Player,Position,ProTeam,RotoTeam,RVid,MLBAMID,BDBID,RotoValue,bG,bAB,bH,bHR,bR,bRBI,bSB,bAvg,pG,pIP,pH,pK,pBB,pER,pWin,pSav,pWHIP,pERA
Kyle Tucker,RF,Astros,,11965,663656,,$-0.00,59,213,56,19,42,40,9,.263,,,,,,,,,,
Jose Altuve,2B,Astros,,5507,514888,altuvjo01,$-0.00,59,241,70,9,34,20,8,.290,,,,,,,,,,
Yordan Alvarez,DH,Astros,,12011,670541,,$-0.00,59,227,64,11,30,25,3,.282,,,,,,,,,,
Jeremy Peña,SS,Astros,,12675,665161,,$-0.00,59,230,68,5,33,21,8,.296,,,,,,,,,,
Ronel Blanco,RP,Astros,,13308,669854,,$-0.00,,,,,,,,,10,59.00,36,57,25,16,5,,1.034,2.44
Josh Hader,RP,Astros,,11246,623352,,$-0.00,,,,,,,,,25,27.00,19,44,10,11,3,8,1.074,3.67
Alex Bregman,3B,Astros,,11366,608324,,$-0.00,57,223,51,8,19,28,2,.229,,,,,,,,,,
Jake Meyers,CF,Astros,,12194,676694,,$-0.00,52,142,39,6,16,22,4,.275,,,,,,,,,,
Mauricio Dubón,None,Astros,,11478,643289,,$-0.00,46,128,39,2,15,20,2,.305,,,,,,,,,,
Justin Verlander,SP,Astros,,1186,434378,verlaju01,$-0.00,,,,,,,,,8,47.00,38,44,15,17,3,,1.128,3.26
Yainer Diaz,C,Astros,,13828,673237,,$-0.00,52,193,48,3,18,23,,.249,,,,,,,,,,
Framber Valdez,SP,Astros,,11653,664285,,$-0.00,,,,,,,,,9,54.67,51,42,17,24,4,,1.244,3.95
Jon Singleton,1B,Astros,,5593,572138,,$-0.00,45,136,30,5,20,14,,.221,,,,,,,,,,
Victor Caratini,C,Astros,,10250,605170,,$-0.00,30,81,20,4,13,15,,.247,,,,,,,,,,
Seth Martinez,RP,Astros,,13762,661527,,$-0.00,,,,,,,,,24,31.33,20,15,12,7,2,1,1.021,2.01
Tayler Scott,RP,Astros,,12513,605463,,$-0.00,,,,,,,,,25,27.67,16,30,15,5,1,,1.120,1.63
Bryan Abreu,RP,Astros,,12329,650556,,$-0.00,,,,,,,,,30,30.67,26,46,16,11,1,,1.370,3.23
Cristian Javier,SP,Astros,,12535,664299,,$-0.00,,,,,,,,,7,34.67,30,27,19,15,3,,1.413,3.89
Spencer Arrighetti,SP,Astros,,15385,681293,,$-0.00,,,,,,,,,9,43.67,49,51,23,29,3,,1.649,5.98
Rafael Montero,RP,Astros,,6241,606160,,$-0.00,,,,,,,,,25,24.67,17,16,8,8,,,1.014,2.92
Joey Loperfido,RF,Astros,,14341,694388,,$-0.00,14,39,13,1,4,5,1,.333,,,,,,,,,,
Chas McCormick,LF,Astros,,12219,676801,,$-0.00,28,91,19,,6,8,2,.209,,,,,,,,,,
Hunter Brown,SP,Astros,,4311,686613,,$-0.00,,,,,,,,,12,55.33,62,60,25,38,1,,1.572,6.18
Ryan Pressly,RP,Astros,,6297,519151,pressry01,$-0.00,,,,,,,,,24,22.33,28,29,8,13,,,1.612,5.24
Trey Cabbage,None,Astros,,13307,663550,,$-0.00,10,14,3,,2,3,,.214,,,,,,,,,,
Miguel Díaz,RP,Astros,,11610,622766,,$-0.00,,,,,,,,,1,1.00,,,,,,,,
Dylan Coleman,RP,Astros,,13861,669395,,$-0.00,,,,,,,,,1,1.00,,1,1,,,,1.000,
Shawn Dubin,None,Astros,,13540,681869,,$-0.00,,,,,,,,,9,13.67,15,13,7,10,,1,1.610,6.59
Alex Speas,SP,Astros,,13576,666208,,$-0.00,,,,,,,,,1,2.00,2,2,1,1,,,1.500,4.50
José Abreu,1B,Astros,,7346,547989,,$-0.00,27,86,10,1,7,5,,.116,,,,,,,,,,
Luis Garcia,SP,Astros,,13434,677651,,$-0.00,,,,,,,,,,,,,,,,,,
Kendall Graveman,RP,Astros,,10474,608665,,$-0.00,,,,,,,,,,,,,,,,,,
Lance McCullers,SP,Astros,,11265,621121,,$-0.00,,,,,,,,,,,,,,,,,,
Penn Murfee,RP,Astros,,13143,682171,,$-0.00,,,,,,,,,,,,,,,,,,
Oliver Ortega,RP,Astros,,13855,661383,,$-0.00,,,,,,,,,,,,,,,,,,
Bennett Sousa,RP,Astros,,13549,656986,,$-0.00,,,,,,,,,,,,,,,,,,
José Urquidy,SP,Astros,,12964,664353,,$-0.00,,,,,,,,,,,,,,,,,,
Jacob Amaya,SS,Astros,,13089,676070,,$-0.00,1,1,,,,,,,,,,,,,,,,
Forrest Whitley,SP,Astros,,12786,666215,,$-0.00,,,,,,,,,1,0.67,1,,1,,,,3.000,
Grae Kessinger,None,Astros,,13236,666197,,$-0.00,11,11,,,1,,,,1,1.00,,,,,,,,
Wander Suero,RP,Astros,,11403,593833,,$-0.00,,,,,,,,,1,,1,,,,,,Inf,
Parker Mushinski,RP,Astros,,14083,656786,,$-0.00,,,,,,,,,8,9.33,9,2,4,6,,,1.393,5.79
J.P. France,SP,Astros,,13982,641585,,$-0.00,,,,,,,,,5,25.33,31,22,12,21,,,1.697,7.46
Blair Henley,RP,Astros,,13758,668874,,$-0.00,,,,,,,,,1,0.33,4,,3,5,,,21.000,135.00
