Player,Position,ProTeam,RotoTeam,RVid,MLBAMID,BDBID,RotoValue,bG,bAB,bH,b2B,b3B,bHR,bTB,bR,bRBI,bSB,bBB,bHBP,bSF,bSH,bAvg,bOBP,pG,pIP,pH,pK,pBB,pER,pWin,pSav,pHld,pS+H,pWHIP,pERA
Aaron Judge,CF/DH/RF,Yankees,,10614,592450,,$65.28,157,570,177,28,,62,391,133,131,16,111,6,5,,.311,.425,,,,,,,,,,,,
Yordan Alvarez,DH/LF,Astros,,12011,670541,,$31.62,135,470,144,29,2,37,288,95,97,1,78,6,7,,.306,.406,,,,,,,,,,,,
Mookie Betts,CF/RF,Dodgers,,7057,605141,,$28.73,142,572,154,40,3,35,305,117,82,12,55,8,4,,.269,.340,,,,,,,,,,,,
Randy Arozarena,DH/LF/RF,Rays,,12085,668227,,$28.27,153,586,154,41,3,20,261,72,89,32,46,11,2,,.263,.327,,,,,,,,,,,,
Julio Rodríguez,CF,Mariners,,13161,677594,,$28.25,132,511,145,25,3,28,260,84,75,25,40,8,1,,.284,.345,,,,,,,,,,,,
Steven Kwan,LF/RF,Guardians,,13364,680757,,$26.63,147,563,168,25,7,6,225,89,52,19,62,7,4,2,.298,.371,,,,,,,,,,,,
Jeff McNeil,2B/DH/LF,Mets,,10691,643446,,$26.42,148,533,174,39,1,9,242,73,62,4,40,11,5,,.326,.382,,,,,,,,,,,,
Daulton Varsho,C/CF/RF,Diamondbacks,,10793,662139,,$25.45,151,531,125,23,3,27,235,79,74,16,46,7,5,2,.235,.301,,,,,,,,,,,,
Cedric Mullins,CF,Orioles,,11721,656775,,$25.25,156,608,157,32,4,16,245,89,64,34,47,9,5,1,.258,.318,,,,,,,,,,,,
Adolis García,CF/DH/RF,Rangers,,12084,666969,,$24.46,156,605,151,34,5,27,276,88,101,25,40,6,6,,.250,.300,,,,,,,,,,,,
Luis Arraez,1B/2B/3B/DH/LF,Twins,,12358,650333,,$24.14,144,547,173,31,1,8,230,88,49,4,50,3,3,,.316,.375,,,,,,,,,,,,
Christian Yelich,DH/LF,Brewers,,5764,592885,yelicch01,$19.78,154,575,145,25,4,14,220,99,57,19,88,5,2,1,.252,.355,,,,,,,,,,,,
George Springer,CF/DH/RF,Blue Jays,,5594,543807,,$19.65,133,513,137,22,4,25,242,89,76,14,54,7,5,,.267,.342,,,,,,,,,,,,
Brandon Nimmo,CF/RF,Mets,,5691,607043,,$19.55,151,580,159,30,7,16,251,102,64,3,71,16,3,3,.274,.366,,,,,,,,,,,,
Starling Marte,CF/RF,Mets,,3367,516782,martest01,$18.99,118,466,136,24,5,16,218,76,63,18,26,13,,,.292,.347,,,,,,,,,,,,
Michael Harris,CF,Braves,,13591,671739,,$18.51,114,414,123,27,3,19,213,75,64,20,21,5,,1,.297,.338,,,,,,,,,,,,
Mike Trout,CF,Angels,,1710,545361,troutmi01,$18.09,119,438,124,28,2,40,276,85,80,1,54,6,1,,.283,.369,,,,,,,,,,,,
Kyle Schwarber,DH/LF,Phillies,,10616,656941,,$15.78,155,577,126,21,3,46,291,100,94,10,86,4,2,,.218,.323,,,,,,,,,,,,
Ian Happ,CF/LF,Cubs,,11673,664023,,$15.25,158,573,155,42,2,17,252,72,72,9,58,6,4,,.271,.342,,,,,,,,,,,,
Taylor Ward,LF/RF,Angels,,11351,621493,,$13.37,135,495,139,22,2,23,234,73,65,5,60,4,5,,.281,.360,,,,,,,,,,,,
Bryan Reynolds,CF,Pirates,,12646,668804,,$11.40,145,542,142,19,4,27,250,74,62,7,56,14,2,,.262,.345,,,,,,,,,,,,
Alex Verdugo,CF/LF/RF,Red Sox,,11451,657077,,$11.04,152,593,166,39,1,11,240,75,74,1,42,3,6,,.280,.328,,,,,,,,,,,,
Andrew Benintendi,LF,Royals,,11492,643217,,$10.02,126,461,140,23,3,5,184,54,51,8,52,2,5,1,.304,.372,,,,,,,,,,,,
Teoscar Hernández,DH/LF/RF,Blue Jays,,9446,606192,,$9.45,131,499,133,35,1,25,245,71,77,6,34,2,,,.267,.316,,,,,,,,,,,,
J.D. Martinez,DH/LF,Red Sox,,5186,502110,martijd02,$8.42,139,533,146,43,1,16,239,76,62,,52,5,5,,.274,.341,,,,,,,,,,,,
MJ Melendez,C/DH/LF,Royals,,12569,669004,,$8.06,129,460,100,21,3,18,181,57,62,2,66,1,7,,.217,.313,,,,,,,,,,,,
Anthony Santander,DH/LF/RF,Orioles,,11612,623993,,$7.02,152,574,138,24,,33,261,78,89,,55,13,5,,.240,.318,,,,,,,,,,,,
Mark Canha,CF/LF/RF,Mets,,5757,592192,,$6.81,140,462,123,24,,13,186,71,61,3,48,28,4,,.266,.367,,,,,,,,,,,,
Gavin Lux,2B/LF/SS,Dodgers,,12174,666158,,$5.62,129,421,116,20,7,6,168,66,42,7,47,,3,,.276,.346,,,,,,,,,,,,
Jake McCarthy,CF/DH/LF/RF,Diamondbacks,,13454,664983,,$5.46,99,321,91,16,3,8,137,53,43,23,23,6,1,3,.283,.339,,,,,,,,,,,,
Jurickson Profar,1B/CF/LF/RF,Padres,,5170,595777,profaju01,$5.03,152,575,140,36,2,15,225,82,58,5,73,4,3,3,.243,.330,,,,,,,,,,,,
Joc Pederson,CF/LF/RF,Giants,,5344,592626,,$4.58,134,380,104,19,3,23,198,57,70,3,42,7,4,,.274,.353,,,,,,,,,,,,
Ryan Mountcastle,1B/DH/LF,Orioles,,11789,663624,,$4.33,145,555,139,28,1,22,235,62,85,4,43,4,7,,.250,.305,,,,,,,,,,,,
Tommy Pham,LF,Reds,,3549,502054,,$4.28,144,554,131,23,1,17,207,89,63,8,56,7,5,,.236,.312,,,,,,,,,,,,
Andrew Vaughn,1B/DH/LF/RF,White Sox,,13192,683734,,$3.86,134,510,138,28,1,17,219,60,76,,31,9,5,,.271,.321,,,,,,,,,,,,
Eric Haase,C/LF,Tigers,,10012,606992,,$2.72,110,323,82,17,1,14,143,41,44,,24,1,3,,.254,.305,,,,,,,,,,,,
Luis Robert,CF,White Sox,,11988,673357,,$2.20,98,380,108,18,,12,162,54,56,11,17,3,1,,.284,.319,,,,,,,,,,,,
Lourdes Gurriel,LF,Blue Jays,,11549,666971,,$2.14,121,453,132,32,1,5,181,52,52,3,31,6,2,,.291,.343,,,,,,,,,,,,
Josh Naylor,1B/DH/LF/RF,Guardians,,11973,647304,,$1.98,122,449,115,28,,20,203,47,79,6,38,6,5,,.256,.319,,,,,,,,,,,,
Ketel Marte,2B/CF/DH,Diamondbacks,,6003,606466,,$1.96,137,492,118,42,2,12,200,68,52,5,55,6,5,,.240,.321,,,,,,,,,,,,
Andrew McCutchen,DH/LF,Brewers,,3354,457705,mccutan01,$1.44,134,515,122,25,,17,198,66,69,8,57,4,4,,.237,.316,,,,,,,,,,,,
Randal Grichuk,CF/RF,Rockies,,5341,545341,,$1.32,140,506,131,21,3,19,215,60,73,4,24,6,2,,.259,.299,,,,,,,,,,,,
Seth Brown,1B/DH/LF/RF,Athletics,,12982,664913,,$1.13,150,500,115,26,3,25,222,55,73,11,51,3,1,,.230,.305,,,,,,,,,,,,
Harold Ramírez,1B/CF/DH/LF/RF,Rays,,10104,623912,,$1.00,120,403,121,24,,6,163,46,58,3,19,9,4,,.300,.343,,,,,,,,,,,,
Seiya Suzuki,CF/RF,Cubs,,13920,673548,,$1.00,111,397,104,22,2,14,172,54,46,9,42,4,3,,.262,.336,,,,,,,,,,,,
Austin Hays,LF/RF,Orioles,,11878,669720,,$1.00,145,535,134,35,2,16,221,66,60,2,34,10,3,,.250,.306,,,,,,,,,,,,
Nick Gordon,2B/CF/LF/SS,Twins,,10638,624503,,$1.00,136,405,110,28,4,9,173,45,50,6,19,10,6,3,.272,.314,,,,,,,,,,,,
Tony Kemp,2B/LF,Athletics,,10962,643393,,$1.00,147,497,117,24,2,7,166,61,46,11,45,8,3,5,.235,.305,,,,,,,,,,,,
Christopher Morel,2B/CF/SS,Cubs,,13401,666624,,$1.00,113,379,89,19,4,16,164,55,47,10,38,3,2,3,.235,.306,,,,,,,,,,,,
Cody Bellinger,CF,Dodgers,,10872,641355,,$0.00,144,504,106,27,3,19,196,70,68,14,38,2,6,,.210,.265,,,,,,,,,,,,
Myles Straw,CF,Guardians,,11977,664702,,$0.00,152,535,118,22,3,,146,72,32,21,54,1,4,2,.221,.290,,,,,,,,,,,,
David Peralta,LF,Diamondbacks,,9450,444482,,$-2.84,134,439,110,30,3,12,182,39,59,1,41,4,6,,.251,.316,,,,,,,,,,,,
Michael A. Taylor,CF,Royals,,5662,572191,,$-3.31,124,414,105,10,3,9,148,49,43,4,35,2,3,2,.254,.311,,,,,,,,,,,,
Lane Thomas,CF/LF/RF,Nationals,,12317,657041,,$-3.93,146,498,120,26,2,17,201,62,52,8,41,4,5,,.241,.301,,,,,,,,,,,,
Leody Taveras,CF,Rangers,,11680,665750,,$-4.48,99,314,82,14,2,5,115,39,34,11,21,2,3,1,.261,.308,,,,,,,,,,,,
Harrison Bader,CF,Cardinals,,11417,664056,,$-4.56,86,292,73,10,3,5,104,38,30,17,15,4,2,,.250,.294,,,,,,,,,,,,
Jesse Winker,LF,Mariners,,6903,608385,,$-4.84,136,456,100,15,,14,157,51,53,,84,4,3,,.219,.344,,,,,,,,,,,,
Mike Yastrzemski,CF/RF,Giants,,7594,573262,,$-4.98,148,485,104,31,2,17,190,73,57,5,61,5,6,1,.214,.305,,,,,,,,,,,,
Tyler O'Neill,CF/LF,Cardinals,,11422,641933,,$-5.00,96,334,76,11,1,14,131,56,58,14,38,4,7,,.228,.308,,,,,,,,,,,,
Oscar Gonzalez,LF/RF,Guardians,,12730,,,$-5.08,91,362,107,27,,11,167,39,43,1,15,3,2,,.296,.327,,,,,,,,,,,,
Yonathan Daza,CF/LF/RF,Rockies,,10999,602074,,$-5.35,113,372,112,21,2,2,143,56,34,,26,4,5,1,.301,.348,,,,,,,,,,,,
Jorge Alfaro,C/LF,Padres,,6742,595751,,$-5.45,82,256,63,14,,7,98,25,40,1,11,4,3,,.246,.285,,,,,,,,,,,,
Dylan Moore,2B/LF/RF/SS,Mariners,,11457,664238,,$-5.57,104,205,46,11,2,6,79,41,24,21,34,13,1,1,.224,.366,,,,,,,,,,,,
Austin Slater,CF/LF/RF,Giants,,11427,596103,,$-5.64,125,277,73,15,2,7,113,49,34,12,40,6,2,,.264,.366,,,,,,,,,,,,
Trey Mancini,1B/DH/LF,Orioles,,9387,641820,,$-5.71,143,519,124,23,1,18,203,56,63,,53,10,5,,.239,.319,,,,,,,,,,,,
Riley Greene,CF,Tigers,,13114,682985,,$-5.79,93,376,95,18,4,5,136,46,42,1,36,3,3,,.253,.321,,,,,,,,,,,,
Eloy Jiménez,DH/LF,White Sox,,11672,650391,,$-6.27,84,292,86,12,,16,146,40,54,,28,3,4,,.295,.358,,,,,,,,,,,,
Brandon Hughes,CF/RP,Cubs,,14370,676714,,$-6.72,1,,,,,,,,,,,,,,,,57,57.67,42,68,21,20,2,8,8,16,1.092,3.12
Raimel Tapia,CF/LF/RF,Blue Jays,,10688,606132,,$-6.88,128,411,109,20,3,7,156,47,52,8,16,,1,3,.265,.290,,,,,,,,,,,,
Chris Taylor,2B/CF/LF/SS,Dodgers,,6789,621035,,$-6.91,118,402,89,25,3,10,150,45,43,10,44,5,3,,.221,.304,,,,,,,,,,,,
AJ Pollock,CF/LF,White Sox,,3706,572041,polloaj01,$-7.03,138,489,120,26,1,14,190,61,56,3,32,2,4,,.245,.292,,,,,,,,,,,,
Brandon Marsh,CF/LF/RF,Angels,,12409,669016,,$-7.22,134,424,104,18,4,11,163,49,52,10,28,3,3,3,.245,.293,,,,,,,,,,,,
Byron Buxton,CF/DH,Twins,,6314,621439,,$-7.52,92,340,76,13,3,28,179,61,51,6,34,7,1,,.224,.306,,,,,,,,,,,,
Dylan Carlson,CF/RF,Cardinals,,11811,666185,,$-7.71,128,432,102,30,4,8,164,56,42,5,45,7,4,,.236,.316,,,,,,,,,,,,
Manuel Margot,CF/LF/RF,Rays,,10226,622534,,$-8.77,89,336,92,18,2,4,126,36,47,7,24,2,1,,.274,.325,,,,,,,,,,,,
Victor Robles,CF,Nationals,,11879,645302,,$-8.99,132,366,82,10,2,6,114,42,33,15,17,9,4,11,.224,.265,,,,,,,,,,,,
Yadiel Hernandez,LF,Nationals,,12230,628450,,$-9.33,94,305,82,16,,9,125,30,41,2,19,1,2,,.269,.312,,,,,,,,,,,,
Trent Grisham,CF,Padres,,12059,663757,,$-9.98,152,451,83,16,2,17,154,58,53,7,57,7,2,7,.184,.281,,,,,,,,,,,,
Chas McCormick,CF/LF/RF,Astros,,12219,676801,,$-9.98,119,359,88,12,2,14,146,47,44,4,46,1,1,,.245,.332,,,,,,,,,,,,
Josh Harrison,2B/3B/LF,White Sox,,3327,543281,harrijo05,$-10.06,119,386,99,19,2,7,143,50,27,2,21,14,2,2,.256,.315,,,,,,,,,,,,
Connor Joe,1B/DH/LF,Rockies,,11834,656582,,$-10.15,111,404,96,20,4,7,145,56,28,6,55,7,1,,.238,.338,,,,,,,,,,,,
Willi Castro,2B/LF/RF/SS,Tigers,,11084,650489,,$-10.72,112,365,88,18,2,8,134,47,31,9,15,8,3,1,.241,.283,,,,,,,,,,,,
Nick Senzel,CF,Reds,,12151,669222,,$-10.74,110,373,86,13,,5,114,45,25,8,30,5,1,2,.231,.294,,,,,,,,,,,,
Aaron Hicks,CF/LF,Yankees,,5349,543305,hicksaa01,$-10.88,130,384,83,9,2,8,120,54,40,10,62,4,2,1,.216,.329,,,,,,,,,,,,
Jake Fraley,LF,Reds,,11828,641584,,$-11.04,68,216,56,9,,12,101,33,28,4,26,3,2,,.259,.344,,,,,,,,,,,,
Alek Thomas,CF,Diamondbacks,,13462,677950,,$-11.10,113,381,88,17,1,8,131,45,39,4,22,3,5,,.231,.275,,,,,,,,,,,,
Max Kepler,CF/RF,Twins,,6050,596146,,$-11.36,115,388,88,18,1,9,135,54,43,3,49,5,4,,.227,.318,,,,,,,,,,,,
Rafael Ortega,CF/DH,Cubs,,6151,542364,ortegra01,$-11.79,118,316,76,14,1,7,113,35,35,12,44,2,7,1,.241,.330,,,,,,,,,,,,
Ben Gamel,CF/DH/LF/RF,Pirates,,5946,592325,,$-12.42,115,371,86,20,2,9,137,42,46,5,48,3,1,,.232,.324,,,,,,,,,,,,
Marcell Ozuna,DH/LF,Braves,,4946,542303,ozunama01,$-12.54,124,470,106,19,,23,194,56,56,2,31,2,4,,.226,.274,,,,,,,,,,,,
Tyrone Taylor,CF/LF/RF,Brewers,,6940,621438,,$-12.72,120,373,87,21,3,17,165,49,51,3,22,7,3,,.233,.286,,,,,,,,,,,,
Luis González,CF/LF/RF,Giants,,12190,670768,,$-12.80,98,311,79,17,2,4,112,31,36,10,30,4,5,,.254,.323,,,,,,,,,,,,
Trayce Thompson,CF/LF/RF,Padres,,932,572204,,$-13.35,80,219,56,14,1,13,111,36,41,4,32,2,2,,.256,.353,,,,,,,,,,,,
Ramón Laureano,CF/RF,Athletics,,11465,657656,,$-13.43,94,346,73,18,,13,130,49,34,11,25,12,,,.211,.287,,,,,,,,,,,,
Bryan De La Cruz,CF/LF/RF,Marlins,,13111,650559,,$-14.08,115,329,83,20,,13,142,38,43,4,19,2,4,,.252,.294,,,,,,,,,,,,
Sam Haggerty,LF/RF,Mariners,,12521,664059,,$-14.22,83,176,45,9,1,5,71,29,23,13,18,4,2,1,.256,.333,,,,,,,,,,,,
Robbie Grossman,LF/RF,Tigers,,3351,543257,grossro01,$-14.63,129,411,86,19,1,7,128,40,45,6,56,6,4,,.209,.310,,,,,,,,,,,,
Kiké Hernández,2B/CF,Red Sox,,5301,571771,,$-15.18,93,361,80,24,,6,122,48,45,,34,3,4,,.222,.291,,,,,,,,,,,,
Tyler Naquin,CF/LF/RF,Reds,,6436,571980,,$-15.50,105,310,71,19,4,11,131,47,46,4,19,4,,1,.229,.281,,,,,,,,,,,,
Aledmys Díaz,1B/2B/3B/LF,Astros,,9486,649557,,$-15.76,92,305,74,13,,12,123,35,38,1,18,2,2,,.243,.287,,,,,,,,,,,,
Matt Vierling,3B/CF/DH/LF/RF,Phillies,,12605,663837,,$-15.78,117,325,80,12,2,6,114,41,32,7,23,3,6,,.246,.297,,,,,,,,,,,,
Michael Brantley,DH/LF,Astros,,1094,488726,brantmi02,$-16.16,64,243,70,14,1,5,101,28,26,1,31,1,1,1,.288,.368,,,,,,,,,,,,
Garrett Hampson,2B/CF/SS,Rockies,,12279,641658,,$-16.40,90,199,42,7,3,2,61,29,15,12,21,1,2,3,.211,.283,,,,,,,,,,,,
Jack Suwinski,LF/RF,Pirates,,12762,669261,,$-16.40,106,326,66,11,,19,134,45,38,4,41,4,1,,.202,.298,,,,,,,,,,,,
Jose Siri,CF/LF,Astros,,10696,642350,,$-16.63,104,301,64,13,2,7,102,53,24,14,20,3,1,,.213,.268,,,,,,,,,,,,
Kevin Kiermaier,CF,Rays,,5374,595281,kiermke01,$-16.94,63,206,47,8,,7,76,28,22,6,14,1,,,.228,.281,,,,,,,,,,,,
Chad Pinder,LF/RF,Athletics,,10889,640461,,$-17.43,111,361,85,18,,12,139,38,42,2,14,,2,1,.235,.262,,,,,,,,,,,,
Darin Ruf,1B/DH/LF,Giants,,5415,573131,rufda01,$-17.85,118,334,68,12,,11,113,52,45,2,45,6,3,,.204,.307,,,,,,,,,,,,
Victor Reyes,CF/RF,Tigers,,10252,622682,,$-18.56,92,315,80,19,3,3,114,27,34,2,13,4,4,,.254,.289,,,,,,,,,,,,
Jarren Duran,CF,Red Sox,,12620,680776,,$-18.56,58,204,45,14,3,3,74,23,17,7,14,4,1,,.221,.283,,,,,,,,,,,,
TJ Friedl,CF/LF,Reds,,12466,670770,,$-18.61,72,225,54,10,5,8,98,33,25,7,20,7,6,,.240,.314,,,,,,,,,,,,
Corey Dickerson,DH/LF,Cardinals,,6308,572816,dickeco01,$-19.30,96,281,75,17,1,6,112,28,36,,12,2,2,,.267,.300,,,,,,,,,,,,
Jo Adell,LF,Angels,,12384,666176,,$-19.73,88,268,60,12,2,8,100,22,27,4,11,4,1,,.224,.264,,,,,,,,,,,,
Bubba Thompson,CF/LF,Rangers,,12814,669352,,$-19.80,55,170,45,5,,1,53,18,9,18,7,2,,2,.265,.298,,,,,,,,,,,,
Rob Refsnyder,1B/CF/LF/RF,Red Sox,,9551,608701,,$-19.85,57,153,47,11,,6,76,25,21,1,15,6,3,,.307,.384,,,,,,,,,,,,
Garrett Mitchell,CF,Brewers,,13702,669003,,$-19.93,28,61,19,3,,2,28,9,9,8,6,,,1,.311,.368,,,,,,,,,,,,
Adam Engel,CF/RF,White Sox,,10981,641553,,$-20.25,119,245,55,13,1,2,76,32,17,12,11,4,,,.224,.269,,,,,,,,,,,,
Kris Bryant,3B/LF/RF,Rockies,,7420,592178,,$-21.24,42,160,49,12,,5,76,28,14,,17,2,2,,.306,.376,,,,,,,,,,,,
Mauricio Dubón,2B/CF/SS,Giants,,11478,643289,,$-21.29,104,243,52,9,,5,76,31,24,2,13,1,5,3,.214,.249,,,,,,,,,,,,
Joey Gallo,LF/RF,Yankees,,6323,608336,,$-21.40,126,350,56,8,2,19,125,48,47,3,56,3,1,,.160,.280,,,,,,,,,,,,
Franchy Cordero,1B/LF/RF,Red Sox,,7602,614173,,$-21.45,84,242,53,17,1,8,96,36,29,4,28,1,2,2,.219,.298,,,,,,,,,,,,
Gilberto Celestino,CF/LF,Twins,,12597,665482,,$-21.53,122,311,74,12,1,2,94,30,24,4,32,2,,2,.238,.311,,,,,,,,,,,,
Juan Yepez,1B/LF,Cardinals,,13865,,,$-21.79,76,253,64,13,,12,113,27,30,,16,1,4,,.253,.296,,,,,,,,,,,,
Eddie Rosario,LF,Braves,,6386,592696,,$-21.85,80,250,53,12,1,5,82,27,24,3,17,,3,,.212,.259,,,,,,,,,,,,
Jesús Sánchez,CF/LF/RF,Marlins,,12159,660821,,$-22.14,98,313,67,14,3,13,126,38,36,1,26,3,1,,.214,.280,,,,,,,,,,,,
Alejo Lopez,2B/LF,Reds,,12779,,,$-22.44,59,145,38,5,1,1,48,15,10,3,9,2,,,.262,.314,,,,,,,,,,,,
Drew Waters,CF,Royals,,12438,671221,,$-22.64,32,96,23,6,1,5,46,14,18,,12,,,,.240,.324,,,,,,,,,,,,
Kyle Isbel,CF/LF/RF,Royals,,12684,664728,,$-22.69,106,256,54,10,4,5,87,32,28,9,16,3,2,1,.211,.263,,,,,,,,,,,,
Adam Duvall,CF/LF/RF,Braves,,6383,594807,,$-23.12,86,287,61,16,1,12,115,39,36,,21,5,2,,.213,.276,,,,,,,,,,,,
Albert Almora Jr.,CF/RF,Reds,,6315,546991,,$-23.37,64,215,48,10,1,5,75,26,29,3,17,1,1,1,.223,.281,,,,,,,,,,,,
Kerry Carpenter,CF,Tigers,,13498,681481,,$-23.37,31,103,26,4,1,6,50,16,10,,6,3,1,,.252,.310,,,,,,,,,,,,
Edward Olivares,CF/LF/RF,Royals,,11665,658668,,$-23.66,53,161,46,8,,4,66,24,15,2,10,2,1,,.286,.333,,,,,,,,,,,,
Jonathan Davis,CF,Brewers,,11784,641505,,$-23.73,37,76,17,1,,,18,9,4,7,14,,,1,.224,.341,,,,,,,,,,,,
Kole Calhoun,DH/LF/RF,Rangers,,5340,594777,calhoko01,$-24.01,125,388,76,14,1,12,128,36,49,3,27,6,3,,.196,.257,,,,,,,,,,,,
Will Brennan,CF,Guardians,,14208,686823,,$-24.09,11,42,15,1,1,1,21,6,8,2,2,1,,,.357,.400,,,,,,,,,,,,
Miguel Andujar,LF,Yankees,,11485,609280,,$-24.09,36,132,31,5,1,1,41,13,17,4,5,,3,,.235,.257,,,,,,,,,,,,
Jorge Soler,DH/LF/RF,Marlins,,6129,624585,,$-24.10,72,270,56,13,,13,108,32,34,,31,3,1,,.207,.295,,,,,,,,,,,,
Jake Meyers,CF,Astros,,12194,676694,,$-24.35,52,150,34,6,2,1,47,13,15,2,7,2,1,,.227,.269,,,,,,,,,,,,
Odúbel Herrera,CF/LF,Phillies,,6103,546318,,$-24.58,62,185,44,9,1,5,70,23,21,6,11,,1,,.238,.279,,,,,,,,,,,,
Pavin Smith,1B/CF/DH/LF/RF,Diamondbacks,,12692,656976,,$-24.62,75,245,54,9,,9,90,24,33,1,28,1,3,,.220,.300,,,,,,,,,,,,
Roman Quinn,CF,Phillies,,6510,596451,,$-24.63,44,79,17,3,2,,24,15,7,4,7,1,,,.215,.287,,,,,,,,,,,,
Kyle Stowers,CF,Orioles,,13301,669065,,$-24.82,34,91,23,4,1,3,38,11,11,,5,2,,,.253,.306,,,,,,,,,,,,
Cooper Hummel,LF,Diamondbacks,,12687,,,$-25.17,66,176,31,8,3,3,54,20,17,4,23,1,1,,.176,.274,,,,,,,,,,,,
José Azocar,CF/LF/RF,Padres,,11353,640492,,$-25.31,98,202,52,9,3,,67,24,10,5,12,,1,1,.257,.296,,,,,,,,,,,,
Josh H. Smith,2B/3B/LF,Rangers,,13412,669701,,$-25.48,73,213,42,5,,2,53,23,16,4,28,7,3,2,.197,.304,,,,,,,,,,,,
Cal Mitchell,LF/RF,Pirates,,12837,,,$-25.57,69,212,48,11,,5,74,21,17,3,18,,1,1,.226,.284,,,,,,,,,,,,
Luke Williams,3B/CF/LF,Marlins,,13073,663897,,$-25.87,79,127,30,5,1,1,40,21,6,11,9,,,,.236,.287,,,,,,,,,,,,
Trevor Larnach,LF/RF,Twins,,12899,663616,,$-25.93,51,160,37,13,,5,65,22,18,,18,,2,,.231,.306,,,,,,,,,,,,
LaMonte Wade,1B/LF/RF,Giants,,11994,664774,,$-26.08,77,217,45,7,1,8,78,29,26,1,26,5,1,2,.207,.303,,,,,,,,,,,,
Nelson Velázquez,CF/LF/RF,Cubs,,12864,676369,,$-26.29,77,185,38,7,3,6,69,20,26,5,19,2,,,.205,.286,,,,,,,,,,,,
Kyle Garlick,LF/RF,Twins,,11663,664247,,$-26.30,66,150,35,3,,9,65,23,18,,8,3,1,,.233,.284,,,,,,,,,,,,
Leury García,2B/CF/LF/RF,White Sox,,4485,544725,garcile02,$-26.37,97,300,63,8,,3,80,38,20,2,7,3,3,2,.210,.232,,,,,,,,,,,,
Akil Baddoo,CF/LF,Tigers,,12928,668731,,$-26.42,73,201,41,3,2,2,54,30,9,9,24,,,,.204,.289,,,,,,,,,,,,
Luis Barrera,CF,Athletics,,12355,642456,,$-26.54,32,77,18,5,,1,26,3,7,3,6,1,1,,.234,.294,,,,,,,,,,,,
Tucupita Marcano,2B/LF,Pirates,,13494,672779,,$-26.60,49,160,33,6,2,2,49,18,13,2,10,1,1,5,.206,.249,,,,,,,,,,,,
Brad Miller,1B/3B/DH/LF,Rangers,,5680,543543,millebr02,$-26.64,81,222,47,3,,7,71,20,32,4,18,,1,,.212,.270,,,,,,,,,,,,
Nick Solak,2B/LF,Rangers,,11997,669256,,$-26.66,35,82,17,1,,3,27,14,4,3,7,5,,1,.207,.305,,,,,,,,,,,,
Peyton Burdick,CF,Marlins,,13693,680814,,$-26.74,31,89,18,4,,4,34,8,11,1,8,2,,,.202,.283,,,,,,,,,,,,
Josh Lowe,CF/RF,Rays,,12156,666139,,$-26.83,52,181,40,12,2,2,62,24,13,3,15,1,,1,.221,.283,,,,,,,,,,,,
Aristides Aquino,LF/RF,Reds,,10680,606157,,$-26.89,80,259,51,13,,10,94,24,30,2,17,,,,.197,.246,,,,,,,,,,,,
Jackie Bradley Jr.,CF/LF/RF,Red Sox,,5843,598265,bradlja02,$-26.98,131,344,70,23,1,4,107,30,38,2,24,,,2,.203,.254,,,,,,,,,,,,
James Outman,CF,Dodgers,,13673,681546,,$-27.16,4,13,6,2,,1,11,6,3,,2,1,,,.462,.562,,,,,,,,,,,,
Eli White,CF/LF/RF,Rangers,,12096,642201,,$-27.19,47,105,21,2,,3,32,16,10,12,11,,1,,.200,.274,,,,,,,,,,,,
Derek Hill,CF,Tigers,,12519,656537,,$-27.25,31,83,19,2,,1,24,8,3,3,5,,1,3,.229,.261,,,,,,,,,,,,
Jordan Luplow,CF/LF/RF,Diamondbacks,,11835,656669,,$-27.31,83,205,36,5,,11,74,26,28,5,25,3,1,,.176,.274,,,,,,,,,,,,
Jerar Encarnación,CF,Marlins,,13063,,,$-27.66,23,77,14,3,,3,26,7,14,2,3,,1,,.182,.210,,,,,,,,,,,,
Alex Call,CF/LF,Nationals,,12104,669743,,$-27.83,47,114,27,3,1,5,47,18,13,3,15,2,,,.237,.336,,,,,,,,,,,,
Travis Jankowski,CF,Mets,,6470,608671,,$-28.15,44,55,9,,,,9,11,2,3,8,1,,,.164,.281,,,,,,,,,,,,
Corbin Carroll,CF/LF,Diamondbacks,,13457,682998,,$-28.27,32,104,27,9,2,4,52,13,14,2,8,3,,,.260,.330,,,,,,,,,,,,
Magneuris Sierra,CF,Angels,,10910,642423,,$-28.44,45,91,15,1,3,,22,7,5,6,4,,,1,.165,.198,,,,,,,,,,,,
Lorenzo Cain,CF,Brewers,,3160,456715,cainlo01,$-28.49,43,145,26,5,,1,34,17,9,2,8,2,1,,.179,.231,,,,,,,,,,,,
Sean Bouchard,1B/LF,Rockies,,13287,656248,,$-28.51,27,74,22,6,,3,37,9,11,,21,1,1,,.297,.454,,,,,,,,,,,,
Steven Duggar,CF,Giants,,11632,621453,,$-28.56,29,72,11,3,1,,16,7,4,5,7,,1,,.153,.225,,,,,,,,,,,,
Ryan McKenna,CF/LF/RF,Orioles,,11803,663630,,$-28.90,104,156,37,10,,2,53,23,11,2,11,2,1,2,.237,.291,,,,,,,,,,,,
Joshua Palacios,CF,Nationals,,12749,641943,,$-29.01,29,47,10,2,,,12,8,2,1,1,1,,,.213,.245,,,,,,,,,,,,
Alex Kirilloff,1B/DH/LF/RF,Twins,,12619,666135,,$-29.26,45,144,36,7,,3,52,14,21,,5,4,2,,.250,.290,,,,,,,,,,,,
Mickey Moniak,CF,Angels,,12583,666160,,$-29.45,37,106,18,3,1,3,32,13,8,1,4,1,,1,.170,.205,,,,,,,,,,,,
J.J. Matijevic,LF,Astros,,13112,,,$-29.55,32,67,14,2,,2,22,7,5,1,2,2,,,.209,.254,,,,,,,,,,,,
Alec Burleson,CF,Cardinals,,13985,676475,,$-29.66,16,48,9,1,,1,13,4,3,1,5,,,,.188,.264,,,,,,,,,,,,
Khalil Lee,CF,Mets,,12767,666137,,$-29.77,2,2,1,,,1,4,1,3,,,,,,.500,.500,,,,,,,,,,,,
Sam Hilliard,CF/LF,Rockies,,12319,656541,,$-29.81,70,174,32,6,1,2,46,26,14,5,23,1,2,,.184,.280,,,,,,,,,,,,
Jake Cave,CF/LF/RF,Twins,,9714,595909,,$-29.99,54,164,35,7,3,5,63,17,20,2,11,,2,,.213,.260,,,,,,,,,,,,
Taylor Trammell,CF/RF,Mariners,,11781,666211,,$-30.42,43,102,20,9,,4,41,15,10,2,13,,1,1,.196,.282,,,,,,,,,,,,
Cristian Pache,CF,Athletics,,12062,665506,,$-30.43,91,241,40,5,2,3,58,18,18,2,15,1,,3,.166,.215,,,,,,,,,,,,
Zach Reks,LF,Rangers,,13056,676646,,$-30.46,16,34,9,1,,,10,3,3,,,,,,.265,.265,,,,,,,,,,,,
Terrance Gore,LF,Mets,,10472,605253,,$-30.58,10,7,1,,,,1,1,,3,,,,1,.143,.125,,,,,,,,,,,,
Adam Haseley,LF,White Sox,,12594,656514,,$-30.64,14,21,5,,,,5,4,2,,3,,,1,.238,.320,,,,,,,,,,,,
Kyle Lewis,CF,Mariners,,12477,641786,,$-30.67,18,56,8,,,3,17,6,5,,5,1,,,.143,.226,,,,,,,,,,,,
Marcus Wilson,CF,Mariners,,11409,657129,,$-30.71,3,5,1,,,,1,1,,,1,,,,.200,.333,,,,,,,,,,,,
Dairon Blanco,LF,Royals,,13439,680118,,$-30.74,5,7,2,,,,2,1,2,1,,,,,.286,.286,,,,,,,,,,,,
Austin Meadows,DH/LF,Tigers,,7454,640457,,$-30.76,36,128,32,6,2,,42,9,11,,16,3,,,.250,.347,,,,,,,,,,,,
Greg Allen,DH/LF,Pirates,,11050,656185,,$-30.79,46,118,22,4,,2,32,17,8,8,10,2,1,3,.186,.254,,,,,,,,,,,,
Estevan Florial,CF,Yankees,,12040,664314,,$-30.83,17,31,3,,,,3,4,1,2,3,1,,,.097,.200,,,,,,,,,,,,
Ben DeLuzio,CF,Cardinals,,7490,641512,,$-30.84,22,20,3,1,,,4,3,,,3,1,,1,.150,.280,,,,,,,,,,,,
JT Riddle,CF,Reds,,10125,595375,,$-30.88,2,4,1,,,,1,,,,,,,,.250,.250,,,,,,,,,,,,
Wilyer Abreu,CF,Astros,,14071,677800,,$-30.90,,,,,,,,,,,,,,,,,,,,,,,,,,,,
Jordyn Adams,CF,Angels,,12660,677941,,$-30.90,,,,,,,,,,,,,,,,,,,,,,,,,,,,
Ross Adolph,CF,Astros,,13223,,,$-30.90,,,,,,,,,,,,,,,,,,,,,,,,,,,,
Carlos Aguiar,CF,Twins,,14810,,,$-30.90,,,,,,,,,,,,,,,,,,,,,,,,,,,,
Shogo Akiyama,CF,Reds,,13052,673451,,$-30.90,,,,,,,,,,,,,,,,,,,,,,,,,,,,
Brady Allen,CF,Marlins,,14471,,,$-30.90,,,,,,,,,,,,,,,,,,,,,,,,,,,,
Tanner Allen,CF,Marlins,,14732,,,$-30.90,,,,,,,,,,,,,,,,,,,,,,,,,,,,
Ariel Almonte,CF,Reds,,14706,,,$-30.90,,,,,,,,,,,,,,,,,,,,,,,,,,,,
Edmond Americaan,CF,Cubs,,13467,,,$-30.90,,,,,,,,,,,,,,,,,,,,,,,,,,,,
Yeuri Amparo,CF,Nationals,,14800,,,$-30.90,,,,,,,,,,,,,,,,,,,,,,,,,,,,
D.J. Artis,CF,Cubs,,13931,,,$-30.90,,,,,,,,,,,,,,,,,,,,,,,,,,,,
Drew Avans,CF,Dodgers,,14375,,,$-30.90,,,,,,,,,,,,,,,,,,,,,,,,,,,,
Yoan Aybar,CF,White Sox,,13013,,,$-30.90,,,,,,,,,,,,,,,,,,,,,,,,,,,,
Joshua Baez,CF,Cardinals,,14731,,,$-30.90,,,,,,,,,,,,,,,,,,,,,,,,,,,,
Luis Baez,CF,Twins,,14674,,,$-30.90,,,,,,,,,,,,,,,,,,,,,,,,,,,,
Dru Baker,CF,Rays,,14621,,,$-30.90,,,,,,,,,,,,,,,,,,,,,,,,,,,,
Zion Bannister,CF,Rangers,,14711,,,$-30.90,,,,,,,,,,,,,,,,,,,,,,,,,,,,
Colin Barber,CF,Astros,,13691,,,$-30.90,,,,,,,,,,,,,,,,,,,,,,,,,,,,
Jorge Barrosa,CF,Diamondbacks,,14042,678489,,$-30.90,,,,,,,,,,,,,,,,,,,,,,,,,,,,
Luis Alexander Basabe,CF,White Sox,,11493,642772,,$-30.90,,,,,,,,,,,,,,,,,,,,,,,,,,,,
Darel Belen,CF,Red Sox,,14743,,,$-30.90,,,,,,,,,,,,,,,,,,,,,,,,,,,,
Micah Bello,CF,Brewers,,13803,,,$-30.90,,,,,,,,,,,,,,,,,,,,,,,,,,,,
Victor Bericoto,CF,Giants,,14710,,,$-30.90,,,,,,,,,,,,,,,,,,,,,,,,,,,,
Braden Bishop,CF,Diamondbacks,,11691,623323,,$-30.90,,,,,,,,,,,,,,,,,,,,,,,,,,,,
JoJo Blackmon,CF,Rangers,,14713,,,$-30.90,,,,,,,,,,,,,,,,,,,,,,,,,,,,
Miguel Bleis,CF,Red Sox,,14744,,,$-30.90,,,,,,,,,,,,,,,,,,,,,,,,,,,,
Ryan Boldt,CF,Rays,,11993,624416,,$-30.90,,,,,,,,,,,,,,,,,,,,,,,,,,,,
Joel Booker,CF,White Sox,,12181,664689,,$-30.90,,,,,,,,,,,,,,,,,,,,,,,,,,,,
Jase Bowen,CF,Pirates,,13120,,,$-30.90,,,,,,,,,,,,,,,,,,,,,,,,,,,,
Jordan Brewer,CF,Astros,,14198,,,$-30.90,,,,,,,,,,,,,,,,,,,,,,,,,,,,
Zach Britton,CF,Blue Jays,,14304,,,$-30.90,,,,,,,,,,,,,,,,,,,,,,,,,,,,
Quinn Brodey,CF,Mets,,12522,656260,,$-30.90,,,,,,,,,,,,,,,,,,,,,,,,,,,,
Dasan Brown,CF,Blue Jays,,14280,,,$-30.90,,,,,,,,,,,,,,,,,,,,,,,,,,,,
Owen Caissie,CF,Cubs,,13962,,,$-30.90,,,,,,,,,,,,,,,,,,,,,,,,,,,,
Sergio Campana,CF,Pirates,,14685,,,$-30.90,,,,,,,,,,,,,,,,,,,,,,,,,,,,
Drew Campbell,CF,Braves,,14240,,,$-30.90,,,,,,,,,,,,,,,,,,,,,,,,,,,,