Player,Position,ProTeam,RotoTeam,RVid,MLBAMID,BDBID,RotoValue,bG,bAB,bH,b2B,b3B,bHR,bRBOE,bR,bRBI,bSB,bCS,bBB,bIBB,bHBP,bSF,bSH,bAvg,bOBP,bSlg,bwOBA,pG,pIP,pBF,pH,pHR,pK,pPO,pFO,pGO,pLO,pSF,pSH,pBB,pIBB,pHB,pR,pER,pWin,pL,pSav,pStk,pFoul,piBall,pPit,pStk%,pWHIP,pERA,pR/9,pFIP,pkwERA
Anthony Rendon,2B/3B,Nationals,,5551,543685,rendoan01,$30.27,153,613,176,39,6,21,,111,83,17,3,58,2,5,5,2,.287,.350,.473,.361,,,,,,,,,,,,,,,,,,,,,,,,,,,,,,
Ian Desmond,SS,Nationals,Old Hoss,2521,435622,desmoia01,$23.06,154,593,151,26,3,24,,73,91,24,5,46,,6,3,,.255,.313,.430,.329,,,,,,,,,,,,,,,,,,,,,,,,,,,,,,
Stephen Strasburg,SP,Nationals,SportsWiseGuy.com,2467,544931,strasst01,$22.36,,,,,,,,,,,,,,,,,,,,,34,215.00,868,198,23,242,,,,,,,43,4,5,86,75,14,11,,2202,,,3295,72.8%,1.121,3.14,3.60,2.85,2.65
Jordan Zimmermann,SP,Nationals,SportsWiseGuy.com,2470,519455,zimmejo02,$21.17,,,,,,,,,,,,,,,,,,,,,32,199.67,800,185,13,182,,,,,,,29,,6,67,59,14,5,,2041,,,2924,76.1%,1.072,2.66,3.02,2.65,3.20
Jayson Werth,RF,Nationals,Big Chee,2390,150029,werthja01,$19.21,147,534,156,37,1,16,,85,82,9,1,83,3,9,3,,.292,.394,.455,.377,,,,,,,,,,,,,,,,,,,,,,,,,,,,,,
Adam LaRoche,1B,Nationals,Dodger Blue,3650,425560,larocad01,$17.51,140,494,128,19,,26,,73,92,3,,82,9,2,8,,.259,.362,.455,.353,,,,,,,,,,,,,,,,,,,,,,,,,,,,,,
Tanner Roark,SP,Nationals,,4393,543699,roarkta01,$16.62,,,,,,,,,,,,,,,,,,,,,31,198.67,798,178,16,138,,,,,,,39,1,6,64,63,15,10,,1951,,,2999,71.0%,1.092,2.85,2.90,3.42,3.98
Denard Span,CF,Nationals,Dodger Blue,1560,452655,spande01,$16.05,147,610,184,39,8,5,,94,37,31,7,50,1,2,3,3,.302,.353,.416,.347,,,,,,,,,,,,,,,,,,,,,,,,,,,,,,
Doug Fister,SP,Nationals,Las Vegas Giants,4254,450729,fistedo01,$14.89,,,,,,,,,,,,,,,,,,,,,25,164.00,662,153,18,98,,,,,,,24,,7,52,44,16,6,,1674,,,2468,74.0%,1.079,2.41,2.85,3.90,4.19
Gio González,SP,Nationals,With the 5th Pick Truck Selects,4787,461829,gonzagi01,$4.65,,,,,,,,,,,,,,,,,,,,,27,158.67,653,134,10,162,,,,,,,56,,3,66,63,10,10,,1659,,,2623,68.4%,1.197,3.57,3.74,2.99,3.51
Asdrúbal Cabrera,2B/SS,Nationals,Moneyball,1079,452678,cabreas01,$4.48,146,553,133,31,4,14,,74,61,10,2,49,2,7,6,1,.241,.307,.387,.307,,,,,,,,,,,,,,,,,,,,,,,,,,,,,,
Rafael Soriano,RP,Nationals,Big Poison,534,400089,soriara01,$4.36,,,,,,,,,,,,,,,,,,,,,64,62.00,252,51,4,59,,,,,,,19,,2,23,22,4,1,32,670,,,1008,71.5%,1.129,3.19,3.34,3.05,3.59
Wilson Ramos,C,Nationals,Texas BigSticks,1523,467092,ramoswi01,$1.00,88,341,91,12,,11,,32,47,,,17,2,,3,,.267,.299,.399,.303,,,,,,,,,,,,,,,,,,,,,,,,,,,,,,
Tyler Clippard,RP,Nationals,Dodger Blue,2427,461325,clippty01,$1.00,,,,,,,,,,,,,,,,,,,,,75,70.33,274,47,5,82,,,,,,,23,1,1,22,17,7,4,1,762,,,1148,70.5%,0.995,2.18,2.82,2.67,2.81
Drew Storen,RP,Nationals,,2466,519322,storedr01,$-3.06,,,,,,,,,,,,,,,,,,,,,65,56.33,224,44,2,46,,,,,,,11,3,3,8,7,2,1,11,546,,,807,73.1%,0.976,1.12,1.28,2.51,3.50
Bryce Harper,LF,Nationals,SportsWiseGuy.com,5074,547180,harpebr03,$-5.45,100,352,96,10,2,13,,41,32,2,2,38,4,1,1,3,.273,.342,.423,.334,,,,,,,,,,,,,,,,,,,,,,,,,,,,,,
Craig Stammen,RP,Nationals,,2465,489334,stammcr01,$-12.71,,,,,,,,,,,,,,,,,,,,,49,72.67,304,78,5,56,,,,,,,14,2,3,34,31,4,5,,738,,,1135,71.9%,1.266,3.84,4.21,3.07,3.77
Aaron Barrett,RP,Nationals,,6980,502578,,$-13.13,,,,,,,,,,,,,,,,,,,,,50,40.67,174,33,1,49,,,,,,,20,2,1,17,12,3,,,410,,,675,65.6%,1.303,2.66,3.76,2.41,3.31
Danny Espinosa,2B,Nationals,,2522,457787,espinda01,$-14.62,114,333,73,14,3,8,,31,27,8,1,18,5,12,1,,.219,.283,.351,.280,,,,,,,,,,,,,,,,,,,,,,,,,,,,,,
Blake Treinen,SP,Nationals,,5673,595014,,$-15.07,,,,,,,,,,,,,,,,,,,,,15,50.67,214,57,1,30,,,,,,,13,1,2,17,14,2,3,,488,,,734,74.3%,1.382,2.49,3.02,3.00,4.50
Matt Thornton,RP,Nationals,,852,407819,thornma01,$-15.23,,,,,,,,,,,,,,,,,,,,,64,36.00,152,33,,28,,,,,,,8,2,5,9,7,1,3,,415,,,637,70.3%,1.139,1.75,2.25,2.46,4.04
Jerry Blevins,RP,Nationals,,4750,460283,blevije01,$-15.54,,,,,,,,,,,,,,,,,,,,,64,57.33,240,48,3,66,,,,,,,23,6,1,31,31,2,3,,638,,,976,70.3%,1.238,4.87,4.87,2.42,2.94
Ryan Zimmerman,3B/LF,Nationals,Old Hoss,2519,475582,zimmery01,$-15.67,61,214,60,19,1,5,,26,38,,,22,,,4,,.280,.342,.449,.343,,,,,,,,,,,,,,,,,,,,,,,,,,,,,,
Nate Schierholtz,RF,Nationals,Texas BigSticks,4172,435625,schiena01,$-16.43,122,353,69,11,4,7,,32,37,4,5,20,,4,6,,.195,.243,.309,.240,,,,,,,,,,,,,,,,,,,,,,,,,,,,,,
Jose Lobaton,C,Nationals,,560,446653,lobatjo01,$-16.99,66,214,50,9,,2,,18,12,,,15,1,1,,,.234,.287,.304,.266,,,,,,,,,,,,,,,,,,,,,,,,,,,,,,
Ross Detwiler,RP,Nationals,,2428,446321,detwiro01,$-17.69,,,,,,,,,,,,,,,,,,,,,47,63.00,270,68,5,39,,,,,,,21,4,5,34,28,2,3,1,662,,,1036,70.5%,1.413,4.00,4.86,3.94,4.63
Ryan Mattheus,RP,Nationals,,2462,458919,matthry01,$-20.63,,,,,,,,,,,,,,,,,,,,,7,8.67,35,7,,4,,,,,,,4,,1,1,1,,,,71,,,121,64.5%,1.269,1.04,1.04,3.91,5.74
A.J. Cole,SP,Nationals,,6757,595918,,$-20.81,,,,,,,,,,,,,,,,,,,,,,,,,,,,,,,,,,,,,,,,,,,,,,,,,3.10,n.a.
Zach Jackson,SP,Nationals,,703,435638,jacksza01,$-20.81,,,,,,,,,,,,,,,,,,,,,,,,,,,,,,,,,,,,,,,,,,,,,,,,,3.10,n.a.
Mitch Lively,SP,Nationals,,5631,518944,,$-20.81,,,,,,,,,,,,,,,,,,,,,,,,,,,,,,,,,,,,,,,,,,,,,,,,,3.10,n.a.
Rafael Martin,SP,Nationals,,2403,514669,,$-20.81,,,,,,,,,,,,,,,,,,,,,,,,,,,,,,,,,,,,,,,,,,,,,,,,,3.10,n.a.
Matt Purke,SP,Nationals,,5550,545357,,$-20.81,,,,,,,,,,,,,,,,,,,,,,,,,,,,,,,,,,,,,,,,,,,,,,,,,3.10,n.a.
Sammy Solis,SP,Nationals,,7149,519301,,$-20.81,,,,,,,,,,,,,,,,,,,,,,,,,,,,,,,,,,,,,,,,,,,,,,,,,3.10,n.a.
Ryan Tatusko,SP,Nationals,,7151,519338,,$-20.81,,,,,,,,,,,,,,,,,,,,,,,,,,,,,,,,,,,,,,,,,,,,,,,,,3.10,n.a.
Felipe Vázquez,SP,Nationals,,6163,553878,,$-20.81,,,,,,,,,,,,,,,,,,,,,,,,,,,,,,,,,,,,,,,,,,,,,,,,,3.10,n.a.
Sean West,SP,Nationals,,1961,476811,westse01,$-20.81,,,,,,,,,,,,,,,,,,,,,,,,,,,,,,,,,,,,,,,,,,,,,,,,,3.10,n.a.
Xavier Cedeño,RP,Nationals,,5517,458584,cedenxa01,$-21.47,,,,,,,,,,,,,,,,,,,,,9,7.00,30,10,1,5,,,,,,,,,,4,3,,,,75,,,112,75.9%,1.429,3.86,5.14,3.53,3.40
Gabriel Alfaro,RP,Nationals,,7357,464963,,$-21.69,,,,,,,,,,,,,,,,,,,,,,,,,,,,,,,,,,,,,,,,,,,,,,,,,3.10,n.a.
Bill Bray,RP,Nationals,,2763,435538,braybi01,$-21.69,,,,,,,,,,,,,,,,,,,,,,,,,,,,,,,,,,,,,,,,,,,,,,,,,3.10,n.a.
Mike Crotta,RP,Nationals,,4998,453273,crottmi01,$-21.69,,,,,,,,,,,,,,,,,,,,,,,,,,,,,,,,,,,,,,,,,,,,,,,,,3.10,n.a.
Erik Davis,RP,Nationals,,5419,458530,daviser02,$-21.69,,,,,,,,,,,,,,,,,,,,,,,,,,,,,,,,,,,,,,,,,,,,,,,,,3.10,n.a.
Manny Delcarmen,RP,Nationals,,40,434668,delcama01,$-21.69,,,,,,,,,,,,,,,,,,,,,,,,,,,,,,,,,,,,,,,,,,,,,,,,,3.10,n.a.
Christian Garcia,RP,Nationals,,229,451600,garcich02,$-21.69,,,,,,,,,,,,,,,,,,,,,,,,,,,,,,,,,,,,,,,,,,,,,,,,,3.10,n.a.
Michael Gonzalez,RP,Nationals,,377,283166,gonzami02,$-21.69,,,,,,,,,,,,,,,,,,,,,,,,,,,,,,,,,,,,,,,,,,,,,,,,,3.10,n.a.
Clay Hensley,RP,Nationals,,1926,454535,henslcl01,$-21.69,,,,,,,,,,,,,,,,,,,,,,,,,,,,,,,,,,,,,,,,,,,,,,,,,3.10,n.a.
Neil Holland,RP,Nationals,,7014,592408,,$-21.69,,,,,,,,,,,,,,,,,,,,,,,,,,,,,,,,,,,,,,,,,,,,,,,,,3.10,n.a.
Zach Kroenke,RP,Nationals,,3600,476127,kroenza01,$-21.69,,,,,,,,,,,,,,,,,,,,,,,,,,,,,,,,,,,,,,,,,,,,,,,,,3.10,n.a.
Chris Manno,RP,Nationals,,6519,573008,,$-21.69,,,,,,,,,,,,,,,,,,,,,,,,,,,,,,,,,,,,,,,,,,,,,,,,,3.10,n.a.
Ross Ohlendorf,RP,Nationals,,3281,456027,ohlenro01,$-21.69,,,,,,,,,,,,,,,,,,,,,,,,,,,,,,,,,,,,,,,,,,,,,,,,,3.10,n.a.
Adam Olbrychowski,RP,Nationals,,5128,446292,,$-21.69,,,,,,,,,,,,,,,,,,,,,,,,,,,,,,,,,,,,,,,,,,,,,,,,,3.10,n.a.
Ryan Perry,RP,Nationals,,1162,543634,perryry01,$-21.69,,,,,,,,,,,,,,,,,,,,,,,,,,,,,,,,,,,,,,,,,,,,,,,,,3.10,n.a.
Tyler Robertson,RP,Nationals,,5531,502356,roberty01,$-21.69,,,,,,,,,,,,,,,,,,,,,,,,,,,,,,,,,,,,,,,,,,,,,,,,,3.10,n.a.
Danny Rosenbaum,RP,Nationals,,6234,572095,,$-21.69,,,,,,,,,,,,,,,,,,,,,,,,,,,,,,,,,,,,,,,,,,,,,,,,,3.10,n.a.
Brandon Sisk,RP,Nationals,,5115,545196,,$-21.69,,,,,,,,,,,,,,,,,,,,,,,,,,,,,,,,,,,,,,,,,,,,,,,,,3.10,n.a.
Daniel Stange,RP,Nationals,,3610,458094,stangda01,$-21.69,,,,,,,,,,,,,,,,,,,,,,,,,,,,,,,,,,,,,,,,,,,,,,,,,3.10,n.a.
Tyler Walker,RP,Nationals,,2443,400104,walkety01,$-21.69,,,,,,,,,,,,,,,,,,,,,,,,,,,,,,,,,,,,,,,,,,,,,,,,,3.10,n.a.
Sandy León,C,Nationals,,5609,506702,leonsa01,$-22.01,20,64,10,1,,1,,7,3,,,6,,,,,.156,.229,.219,.209,,,,,,,,,,,,,,,,,,,,,,,,,,,,,,
Taylor Jordan,SP,Nationals,,6979,518863,jordata01,$-22.39,,,,,,,,,,,,,,,,,,,,,5,25.67,124,34,3,17,,,,,,,8,1,2,20,16,,3,,275,,,429,72.0%,1.636,5.61,7.01,4.35,4.62
Brandon Bantz,C,Nationals,,7081,572702,bantzbr01,$-22.84,,,,,,,,,,,,,,,,,,,,,,,,,,,,,,,,,,,,,,,,,,,,,,,,,,
Mitch Canham,C,Nationals,,3938,502262,,$-22.84,,,,,,,,,,,,,,,,,,,,,,,,,,,,,,,,,,,,,,,,,,,,,,,,,,
Jeff Howell,C,Nationals,,1369,459920,,$-22.84,,,,,,,,,,,,,,,,,,,,,,,,,,,,,,,,,,,,,,,,,,,,,,,,,,
Brian Jeroloman,C,Nationals,,725,502089,,$-22.84,,,,,,,,,,,,,,,,,,,,,,,,,,,,,,,,,,,,,,,,,,,,,,,,,,
Carlos Maldonado,C,Nationals,,2478,430961,maldoca03,$-22.84,,,,,,,,,,,,,,,,,,,,,,,,,,,,,,,,,,,,,,,,,,,,,,,,,,
Sean McCauley,C,Nationals,,7356,,,$-22.84,,,,,,,,,,,,,,,,,,,,,,,,,,,,,,,,,,,,,,,,,,,,,,,,,,
Samuel Palace,C,Nationals,,7153,,,$-22.84,,,,,,,,,,,,,,,,,,,,,,,,,,,,,,,,,,,,,,,,,,,,,,,,,,
Jhonatan Solano,C,Nationals,,2485,500207,solanjh01,$-22.84,,,,,,,,,,,,,,,,,,,,,,,,,,,,,,,,,,,,,,,,,,,,,,,,,,
Kris Watts,C,Nationals,,3297,502454,,$-22.84,,,,,,,,,,,,,,,,,,,,,,,,,,,,,,,,,,,,,,,,,,,,,,,,,,
Robert Benincasa,P,Nationals,,8687,,,$-23.81,,,,,,,,,,,,,,,,,,,,,,,,,,,,,,,,,,,,,,,,,,,,,,,,,3.10,n.a.
Brett Brach,P,Nationals,,10093,,,$-23.81,,,,,,,,,,,,,,,,,,,,,,,,,,,,,,,,,,,,,,,,,,,,,,,,,3.10,n.a.
Paul Demny,P,Nationals,,7144,518611,,$-23.81,,,,,,,,,,,,,,,,,,,,,,,,,,,,,,,,,,,,,,,,,,,,,,,,,3.10,n.a.
Brian Dupra,P,Nationals,,9724,,,$-23.81,,,,,,,,,,,,,,,,,,,,,,,,,,,,,,,,,,,,,,,,,,,,,,,,,3.10,n.a.
Marcos Frias,P,Nationals,,7145,506728,,$-23.81,,,,,,,,,,,,,,,,,,,,,,,,,,,,,,,,,,,,,,,,,,,,,,,,,3.10,n.a.
Robert Gilliam,P,Nationals,,9725,,,$-23.81,,,,,,,,,,,,,,,,,,,,,,,,,,,,,,,,,,,,,,,,,,,,,,,,,3.10,n.a.
Trevor Holder,P,Nationals,,7146,457774,,$-23.81,,,,,,,,,,,,,,,,,,,,,,,,,,,,,,,,,,,,,,,,,,,,,,,,,3.10,n.a.
Pat Lehman,P,Nationals,,6981,543440,,$-23.81,,,,,,,,,,,,,,,,,,,,,,,,,,,,,,,,,,,,,,,,,,,,,,,,,3.10,n.a.
Jeff Mandel,P,Nationals,,6787,453247,,$-23.81,,,,,,,,,,,,,,,,,,,,,,,,,,,,,,,,,,,,,,,,,,,,,,,,,3.10,n.a.
Cameron Selik,P,Nationals,,7148,594991,,$-23.81,,,,,,,,,,,,,,,,,,,,,,,,,,,,,,,,,,,,,,,,,,,,,,,,,3.10,n.a.
Matt Swynenberg,P,Nationals,,7150,573192,,$-23.81,,,,,,,,,,,,,,,,,,,,,,,,,,,,,,,,,,,,,,,,,,,,,,,,,3.10,n.a.
Rob Wort,P,Nationals,,7152,573257,,$-23.81,,,,,,,,,,,,,,,,,,,,,,,,,,,,,,,,,,,,,,,,,,,,,,,,,3.10,n.a.
Taylor Hill,RP,Nationals,,9438,592398,,$-23.97,,,,,,,,,,,,,,,,,,,,,3,9.00,45,16,,5,,,,,,,3,1,2,9,9,,1,,96,,,155,72.3%,2.111,9.00,9.00,3.32,5.13
Kevin Frandsen,1B/2B/3B/LF,Nationals,,119,435623,frandke01,$-25.14,105,220,57,8,,1,,17,17,,,6,,7,1,2,.259,.297,.309,.275,,,,,,,,,,,,,,,,,,,,,,,,,,,,,,
Tyler Moore,1B/LF,Nationals,,2493,489138,moorety01,$-26.66,42,91,21,2,,4,,8,14,,,7,,2,,,.231,.300,.385,.303,,,,,,,,,,,,,,,,,,,,,,,,,,,,,,
Scott Hairston,RF,Nationals,,4004,430668,hairssc01,$-27.44,61,77,16,4,,1,,6,8,,,4,,2,4,,.208,.253,.299,.243,,,,,,,,,,,,,,,,,,,,,,,,,,,,,,
Michael A. Taylor,RF,Nationals,,5662,572191,,$-27.77,17,39,8,3,,1,,5,5,,2,3,,1,,,.205,.279,.359,.259,,,,,,,,,,,,,,,,,,,,,,,,,,,,,,
Steven Souza Jr.,CF,Nationals,,2518,519306,,$-28.71,21,23,3,,,2,,2,2,,,3,,,,,.130,.231,.391,.269,,,,,,,,,,,,,,,,,,,,,,,,,,,,,,
Isaac Ballou,LF,Nationals,,9448,643208,,$-29.79,,,,,,,,,,,,,,,,,,,,,,,,,,,,,,,,,,,,,,,,,,,,,,,,,,
Joseph Dunigan,LF,Nationals,,4298,452775,,$-29.79,,,,,,,,,,,,,,,,,,,,,,,,,,,,,,,,,,,,,,,,,,,,,,,,,,
Jerad Head,RF,Nationals,,1055,502968,headje01,$-29.79,,,,,,,,,,,,,,,,,,,,,,,,,,,,,,,,,,,,,,,,,,,,,,,,,,
Destin Hood,LF,Nationals,,2539,543329,,$-29.79,,,,,,,,,,,,,,,,,,,,,,,,,,,,,,,,,,,,,,,,,,,,,,,,,,
Quincy Latimore,LF,Nationals,,3366,518921,,$-29.79,,,,,,,,,,,,,,,,,,,,,,,,,,,,,,,,,,,,,,,,,,,,,,,,,,
Estarlin Martinez,RF,Nationals,,6786,570268,,$-29.79,,,,,,,,,,,,,,,,,,,,,,,,,,,,,,,,,,,,,,,,,,,,,,,,,,
Brandon Miller,RF,Nationals,,9437,,,$-29.79,,,,,,,,,,,,,,,,,,,,,,,,,,,,,,,,,,,,,,,,,,,,,,,,,,
Randolph Oduber,LF,Nationals,,5876,571997,,$-29.79,,,,,,,,,,,,,,,,,,,,,,,,,,,,,,,,,,,,,,,,,,,,,,,,,,
Caleb Ramsey,LF,Nationals,,6825,548324,,$-29.79,,,,,,,,,,,,,,,,,,,,,,,,,,,,,,,,,,,,,,,,,,,,,,,,,,
Oscar Tejeda,LF,Nationals,,151,520988,,$-29.79,,,,,,,,,,,,,,,,,,,,,,,,,,,,,,,,,,,,,,,,,,,,,,,,,,
James Van Ostrand,LF,Nationals,,3031,450634,,$-29.79,,,,,,,,,,,,,,,,,,,,,,,,,,,,,,,,,,,,,,,,,,,,,,,,,,
Drew Vettleson,RF,Nationals,,6921,592828,,$-29.79,,,,,,,,,,,,,,,,,,,,,,,,,,,,,,,,,,,,,,,,,,,,,,,,,,
Theo Bowe,CF,Nationals,,7123,,,$-29.86,,,,,,,,,,,,,,,,,,,,,,,,,,,,,,,,,,,,,,,,,,,,,,,,,,
Cutter Dykstra,CF,Nationals,,3162,543127,,$-29.86,,,,,,,,,,,,,,,,,,,,,,,,,,,,,,,,,,,,,,,,,,,,,,,,,,
Brian Goodwin,CF,Nationals,,6504,571718,,$-29.86,,,,,,,,,,,,,,,,,,,,,,,,,,,,,,,,,,,,,,,,,,,,,,,,,,
Pedro Florimon,SS,Nationals,,463,465753,floripe01,$-29.96,33,76,7,1,1,,,7,1,6,,8,,,,2,.092,.174,.132,.172,,,,,,,,,,,,,,,,,,,,,,,,,,,,,,
Emmanuel Burriss,2B,Nationals,,4126,502034,burriem01,$-30.30,,,,,,,,,,,,,,,,,,,,,,,,,,,,,,,,,,,,,,,,,,,,,,,,,,
Melvin Dorta,2B,Nationals,,2501,468936,dortame01,$-30.30,,,,,,,,,,,,,,,,,,,,,,,,,,,,,,,,,,,,,,,,,,,,,,,,,,
Rick Hague,SS,Nationals,,6785,518756,,$-30.30,,,,,,,,,,,,,,,,,,,,,,,,,,,,,,,,,,,,,,,,,,,,,,,,,,
Jose Lozada,SS,Nationals,,2529,543471,,$-30.30,,,,,,,,,,,,,,,,,,,,,,,,,,,,,,,,,,,,,,,,,,,,,,,,,,
Jason Martinson,SS,Nationals,,5983,592535,,$-30.30,,,,,,,,,,,,,,,,,,,,,,,,,,,,,,,,,,,,,,,,,,,,,,,,,,
David Masters,SS,Nationals,,10113,607635,,$-30.30,,,,,,,,,,,,,,,,,,,,,,,,,,,,,,,,,,,,,,,,,,,,,,,,,,
Stephen Perez,SS,Nationals,,7214,572028,,$-30.30,,,,,,,,,,,,,,,,,,,,,,,,,,,,,,,,,,,,,,,,,,,,,,,,,,
Tony Renda,2B,Nationals,,9436,573113,,$-30.30,,,,,,,,,,,,,,,,,,,,,,,,,,,,,,,,,,,,,,,,,,,,,,,,,,
Will Rhymes,2B,Nationals,,1222,489242,rhymewi01,$-30.30,,,,,,,,,,,,,,,,,,,,,,,,,,,,,,,,,,,,,,,,,,,,,,,,,,
Adríán Sanchez,2B,Nationals,,5871,506703,,$-30.30,,,,,,,,,,,,,,,,,,,,,,,,,,,,,,,,,,,,,,,,,,,,,,,,,,
Francisco Soriano,2B,Nationals,,2508,524308,,$-30.30,,,,,,,,,,,,,,,,,,,,,,,,,,,,,,,,,,,,,,,,,,,,,,,,,,
Jeff Kobernus,2B,Nationals,,5666,571862,koberje01,$-30.32,4,6,,,,,,2,,,,1,,1,,,,.250,,.175,,,,,,,,,,,,,,,,,,,,,,,,,,,,,,
Nate McLouth,CF/LF,Nationals,With the 5th Pick Truck Selects,1864,434661,mclouna01,$-30.46,79,139,24,6,,1,,10,7,4,1,16,1,5,1,1,.173,.278,.237,.246,,,,,,,,,,,,,,,,,,,,,,,,,,,,,,
Jamey Carroll,3B/SS,Nationals,,4645,425206,carroja01,$-30.53,,,,,,,,,,,,,,,,,,,,,,,,,,,,,,,,,,,,,,,,,,,,,,,,,,
Josh Johnson,3B,Nationals,,6879,461835,,$-30.53,,,,,,,,,,,,,,,,,,,,,,,,,,,,,,,,,,,,,,,,,,,,,,,,,,
Brandon Laird,3B,Nationals,,305,477186,lairdbr01,$-30.53,,,,,,,,,,,,,,,,,,,,,,,,,,,,,,,,,,,,,,,,,,,,,,,,,,
Sean Nicol,3B,Nationals,,6906,573059,,$-30.53,,,,,,,,,,,,,,,,,,,,,,,,,,,,,,,,,,,,,,,,,,,,,,,,,,
Khayyan Norfork,3B,Nationals,,9974,607341,,$-30.53,,,,,,,,,,,,,,,,,,,,,,,,,,,,,,,,,,,,,,,,,,,,,,,,,,
Matt Skole,3B,Nationals,,6243,605474,,$-30.53,,,,,,,,,,,,,,,,,,,,,,,,,,,,,,,,,,,,,,,,,,,,,,,,,,
Justin Bloxom,1B,Nationals,,5665,572721,,$-30.65,,,,,,,,,,,,,,,,,,,,,,,,,,,,,,,,,,,,,,,,,,,,,,,,,,
Mauro Gomez,1B,Nationals,,5451,450855,gomezma01,$-30.65,,,,,,,,,,,,,,,,,,,,,,,,,,,,,,,,,,,,,,,,,,,,,,,,,,
Greg Dobbs,1B,Nationals,,2331,425785,dobbsgr01,$-31.20,36,41,7,1,,,,,2,,,1,,,1,,.171,.186,.195,.171,,,,,,,,,,,,,,,,,,,,,,,,,,,,,,
Rafael Bautista,OF,Nationals,,10110,622441,,$-32.70,,,,,,,,,,,,,,,,,,,,,,,,,,,,,,,,,,,,,,,,,,,,,,,,,,
Will Piwnica-Worms,OF,Nationals,,10124,,,$-32.70,,,,,,,,,,,,,,,,,,,,,,,,,,,,,,,,,,,,,,,,,,,,,,,,,,
