Player,Position,ProTeam,RotoTeam,RVid,MLBAMID,BDBID,RotoValue,pG,pIP,pBF,pH,pHR,pK,pPO,pFO,pGO,pLO,pSF,pSH,pBB,pIBB,pHB,pR,pER,pWin,pL,pSav,pStk,pFoul,piBall,pPit,pStk%,pWHIP,pERA,pR/9,pFIP,pkwERA,bG,bAB,bH,b2B,b3B,bHR,bRBOE,bR,bRBI,bSB,bCS,bBB,bIBB,bHBP,bSF,bSH,bAvg,bOBP,bSlg,bwOBA
Brian Dozier,2B,Twins,SportsWiseGuy.com,5087,572821,doziebr01,$23.25,,,,,,,,,,,,,,,,,,,,,,,,,,,,,,,156,598,145,33,1,23,,112,71,21,7,89,1,9,8,3,.242,.344,.416,.338
Danny Santana,CF/SS,Twins,,5347,542454,,$8.33,,,,,,,,,,,,,,,,,,,,,,,,,,,,,,,101,405,129,27,7,7,,70,40,20,4,19,,3,1,2,.319,.351,.472,.366
Trevor Plouffe,3B,Twins,,1546,461858,plouftr01,$6.94,,,,,,,,,,,,,,,,,,,,,,,,,,,,,,,136,520,134,40,2,14,,69,80,2,1,53,2,4,5,,.258,.328,.423,.327
Joe Mauer,1B/C/DH,Twins,SportsWiseGuy.com,1521,408045,mauerjo01,$4.25,,,,,,,,,,,,,,,,,,,,,,,,,,,,,,,120,455,126,27,2,4,,60,55,3,,60,12,1,2,,.277,.361,.371,.324
Oswaldo Arcia,LF/RF,Twins,,5532,542455,arciaos01,$1.00,,,,,,,,,,,,,,,,,,,,,,,,,,,,,,,103,372,86,16,3,20,,46,57,1,2,31,4,6,1,,.231,.300,.452,.319
Kurt Suzuki,C,Twins,,4816,435559,suzukku01,$1.00,,,,,,,,,,,,,,,,,,,,,,,,,,,,,,,131,452,130,34,,3,,37,61,,1,34,,9,7,1,.288,.344,.383,.322
Eduardo Escobar,3B/SS,Twins,,917,500871,escobed01,$-6.73,,,,,,,,,,,,,,,,,,,,,,,,,,,,,,,133,433,119,35,2,6,,52,37,1,1,24,1,2,2,4,.275,.312,.406,.314
Jordan Schafer,CF/LF/RF,Twins,,1866,457788,schafjo02,$-11.39,,,,,,,,,,,,,,,,,,,,,,,,,,,,,,,104,210,50,9,1,1,,26,15,30,7,22,1,,,8,.238,.300,.305,.297
Josmil Pinto,C/DH,Twins,,5941,500887,pintojo01,$-12.00,,,,,,,,,,,,,,,,,,,,,,,,,,,,,,,57,169,37,8,,7,,25,18,,1,24,,1,3,,.219,.315,.391,.309
Kennys Vargas,1B/DH,Twins,,6989,573627,,$-12.16,,,,,,,,,,,,,,,,,,,,,,,,,,,,,,,53,215,59,10,1,9,,26,38,,,12,2,3,4,,.274,.316,.456,.329
Eduardo Núñez,3B/SS,Twins,,314,456488,nunezed02,$-15.38,,,,,,,,,,,,,,,,,,,,,,,,,,,,,,,72,204,51,7,4,4,,26,24,9,3,5,,1,,3,.250,.268,.382,.288
Chris Colabello,1B,Twins,,6327,499624,colabch01,$-17.57,,,,,,,,,,,,,,,,,,,,,,,,,,,,,,,59,205,47,13,,6,,17,39,,2,14,1,1,,,.229,.282,.380,.284
Chris Parmelee,1B/LF/RF,Twins,,1530,476633,parmech01,$-17.72,,,,,,,,,,,,,,,,,,,,,,,,,,,,,,,87,250,64,11,,7,,27,28,,3,17,,2,1,,.256,.307,.384,.300
Eric Fryer,C,Twins,,3362,518700,fryerer01,$-19.59,,,,,,,,,,,,,,,,,,,,,,,,,,,,,,,28,75,16,4,,1,,11,5,1,,5,,1,,,.213,.272,.307,.264
Aaron Hicks,CF,Twins,,5349,543305,hicksaa01,$-21.96,,,,,,,,,,,,,,,,,,,,,,,,,,,,,,,69,186,40,8,,1,,22,18,4,3,36,,,1,2,.215,.338,.274,.290
Kyle Knudson,C,Twins,,6326,571861,,$-22.84,,,,,,,,,,,,,,,,,,,,,,,,,,,,,,,,,,,,,,,,,,,,,,,,,,
Matt Koch,C,Twins,,7397,592472,,$-22.84,,,,,,,,,,,,,,,,,,,,,,,,,,,,,,,,,,,,,,,,,,,,,,,,,,
Danny Lehmann,C,Twins,,1519,446283,,$-22.84,,,,,,,,,,,,,,,,,,,,,,,,,,,,,,,,,,,,,,,,,,,,,,,,,,
Dan Rohlfing,C,Twins,,5280,519221,,$-22.84,,,,,,,,,,,,,,,,,,,,,,,,,,,,,,,,,,,,,,,,,,,,,,,,,,
Stuart Turner,C,Twins,,7398,642156,,$-22.84,,,,,,,,,,,,,,,,,,,,,,,,,,,,,,,,,,,,,,,,,,,,,,,,,,
Brian Dinkelman,DH,Twins,,1534,501920,dinkebr01,$-22.87,,,,,,,,,,,,,,,,,,,,,,,,,,,,,,,,,,,,,,,,,,,,,,,,,,
Travis Harrison,DH,Twins,,6111,595974,,$-22.87,,,,,,,,,,,,,,,,,,,,,,,,,,,,,,,,,,,,,,,,,,,,,,,,,,
Chris Herrmann,C/RF,Twins,,5086,543302,herrmch01,$-23.76,,,,,,,,,,,,,,,,,,,,,,,,,,,,,,,33,75,16,3,,,,8,4,1,,4,,,,,.213,.253,.253,.234
Jason Kubel,DH/LF,Twins,,1582,430585,kubelja01,$-28.13,,,,,,,,,,,,,,,,,,,,,,,,,,,,,,,45,156,35,6,1,1,,12,13,1,,19,1,1,,,.224,.312,.295,.280
Jorge Polanco,2B,Twins,,6049,593871,,$-29.18,,,,,,,,,,,,,,,,,,,,,,,,,,,,,,,5,6,2,1,1,,,2,3,,,2,,,,,.333,.500,.833,.531
Evan Bigley,LF,Twins,,1569,542934,,$-29.79,,,,,,,,,,,,,,,,,,,,,,,,,,,,,,,,,,,,,,,,,,,,,,,,,,
Jonathan Goncalves,RF,Twins,,5348,500892,,$-29.79,,,,,,,,,,,,,,,,,,,,,,,,,,,,,,,,,,,,,,,,,,,,,,,,,,
Max Kepler,LF,Twins,,6050,596146,,$-29.79,,,,,,,,,,,,,,,,,,,,,,,,,,,,,,,,,,,,,,,,,,,,,,,,,,
Danny Ortiz,LF,Twins,,11370,543611,,$-29.79,,,,,,,,,,,,,,,,,,,,,,,,,,,,,,,,,,,,,,,,,,,,,,,,,,
Chris Rahl,RF,Twins,,3707,473922,,$-29.79,,,,,,,,,,,,,,,,,,,,,,,,,,,,,,,,,,,,,,,,,,,,,,,,,,
Wilkin Ramirez,LF,Twins,,1262,457133,ramirwi01,$-29.79,,,,,,,,,,,,,,,,,,,,,,,,,,,,,,,,,,,,,,,,,,,,,,,,,,
Adam Walker,RF,Twins,,10235,608724,,$-29.79,,,,,,,,,,,,,,,,,,,,,,,,,,,,,,,,,,,,,,,,,,,,,,,,,,
Doug Bernier,SS,Twins,,3335,448674,bernido01,$-29.84,,,,,,,,,,,,,,,,,,,,,,,,,,,,,,,7,7,2,,,,,2,,,,1,,1,,,.286,.444,.286,.356
Byron Buxton,CF,Twins,,6314,621439,,$-29.86,,,,,,,,,,,,,,,,,,,,,,,,,,,,,,,,,,,,,,,,,,,,,,,,,,
Jermaine Mitchell,CF,Twins,,4855,501827,,$-29.86,,,,,,,,,,,,,,,,,,,,,,,,,,,,,,,,,,,,,,,,,,,,,,,,,,
Corey Wimberly,CF,Twins,,4852,489432,,$-29.86,,,,,,,,,,,,,,,,,,,,,,,,,,,,,,,,,,,,,,,,,,,,,,,,,,
Jason Bartlett,SS,Twins,,586,430583,bartlja01,$-29.91,,,,,,,,,,,,,,,,,,,,,,,,,,,,,,,3,3,,,,,,3,,,,,,1,,,,.250,,.175
James Beresford,2B,Twins,,1550,503437,,$-30.30,,,,,,,,,,,,,,,,,,,,,,,,,,,,,,,,,,,,,,,,,,,,,,,,,,
Eric Farris,2B,Twins,,3138,456544,farrier01,$-30.30,,,,,,,,,,,,,,,,,,,,,,,,,,,,,,,,,,,,,,,,,,,,,,,,,,
Harold Garcia,2B,Twins,,5060,467833,,$-30.30,,,,,,,,,,,,,,,,,,,,,,,,,,,,,,,,,,,,,,,,,,,,,,,,,,
Niko Goodrum,SS,Twins,,6048,592348,,$-30.30,,,,,,,,,,,,,,,,,,,,,,,,,,,,,,,,,,,,,,,,,,,,,,,,,,
Nate Hanson,2B,Twins,,5346,543275,,$-30.30,,,,,,,,,,,,,,,,,,,,,,,,,,,,,,,,,,,,,,,,,,,,,,,,,,
Aderlin Mejia,SS,Twins,,9969,593951,,$-30.30,,,,,,,,,,,,,,,,,,,,,,,,,,,,,,,,,,,,,,,,,,,,,,,,,,
Levi Michael,2B,Twins,,6110,605381,,$-30.30,,,,,,,,,,,,,,,,,,,,,,,,,,,,,,,,,,,,,,,,,,,,,,,,,,
Adam Pettersen,SS,Twins,,7253,,,$-30.30,,,,,,,,,,,,,,,,,,,,,,,,,,,,,,,,,,,,,,,,,,,,,,,,,,
Eddie Rosario,2B,Twins,,6386,592696,,$-30.30,,,,,,,,,,,,,,,,,,,,,,,,,,,,,,,,,,,,,,,,,,,,,,,,,,
Miguel Sanó,SS,Twins,,6302,593934,,$-30.30,,,,,,,,,,,,,,,,,,,,,,,,,,,,,,,,,,,,,,,,,,,,,,,,,,
Tony Thomas,2B,Twins,,2663,506917,,$-30.30,,,,,,,,,,,,,,,,,,,,,,,,,,,,,,,,,,,,,,,,,,,,,,,,,,
Brad Boyer,3B,Twins,,4125,460133,,$-30.53,,,,,,,,,,,,,,,,,,,,,,,,,,,,,,,,,,,,,,,,,,,,,,,,,,
Mike Kvasnicka,3B,Twins,,5183,518909,,$-30.53,,,,,,,,,,,,,,,,,,,,,,,,,,,,,,,,,,,,,,,,,,,,,,,,,,
Deibinson Romero,3B,Twins,,1548,466480,,$-30.53,,,,,,,,,,,,,,,,,,,,,,,,,,,,,,,,,,,,,,,,,,,,,,,,,,
Mark Sobolewski,3B,Twins,,6328,502176,,$-30.53,,,,,,,,,,,,,,,,,,,,,,,,,,,,,,,,,,,,,,,,,,,,,,,,,,
Brandon Waring,3B,Twins,,456,519397,,$-30.53,,,,,,,,,,,,,,,,,,,,,,,,,,,,,,,,,,,,,,,,,,,,,,,,,,
Stephen Wickens,3B,Twins,,10098,607770,,$-30.53,,,,,,,,,,,,,,,,,,,,,,,,,,,,,,,,,,,,,,,,,,,,,,,,,,
Jeff Clement,1B,Twins,,3301,459943,clemeje01,$-30.65,,,,,,,,,,,,,,,,,,,,,,,,,,,,,,,,,,,,,,,,,,,,,,,,,,
Brad Nelson,1B,Twins,,4303,434525,nelsobr02,$-30.65,,,,,,,,,,,,,,,,,,,,,,,,,,,,,,,,,,,,,,,,,,,,,,,,,,
Reynaldo Rodriguez,1B,Twins,,5432,471906,,$-30.65,,,,,,,,,,,,,,,,,,,,,,,,,,,,,,,,,,,,,,,,,,,,,,,,,,
Curt Smith,OF,Twins,,3504,543791,,$-32.70,,,,,,,,,,,,,,,,,,,,,,,,,,,,,,,,,,,,,,,,,,,,,,,,,,
