Player,Position,ProTeam,RotoTeam,RVid,MLBAMID,BDBID,RotoValue,pG,pIP,pH,pHR,pK,pBB,pIBB,pHB,pER,pWin,pL,pSav,pWHIP,pERA,pFIP,bG,bAB,bH,b2B,b3B,bHR,bRBOE,bR,bRBI,bSB,bCS,bBB,bIBB,bHBP,bSF,bSH,bAvg,bOBP,bSlg,bwOBA
Paul Goldschmidt,1B,Diamondbacks,,3648,502671,goldspa01,$45.85,,,,,,,,,,,,,,,,159,567,182,38,2,33,4,103,110,21,5,118,29,2,7,,.321,.435,.570,.428
Chris Davis,1B/3B/DH/RF,Orioles,,4462,448801,davisch02,$34.36,,,,,,,,,,,,,,,,160,573,150,31,,47,4,100,117,2,3,84,6,8,5,,.262,.361,.562,.392
Buster Posey,1B/C,Giants,,4108,457763,poseybu01,$33.38,,,,,,,,,,,,,,,,150,557,177,28,,19,3,74,95,2,,56,10,3,7,,.318,.379,.470,.371
Anthony Rizzo,1B,Cubs,,113,519203,rizzoan01,$31.08,,,,,,,,,,,,,,,,160,586,163,38,3,31,6,94,101,17,6,78,9,30,7,,.278,.387,.512,.393
Edwin Encarnación,1B/DH,Blue Jays,,753,429665,encared01,$30.54,,,,,,,,,,,,,,,,146,528,146,31,,39,3,94,111,3,2,77,5,9,10,,.277,.372,.557,.395
Joey Votto,1B,Reds,,2825,458015,vottojo01,$29.69,,,,,,,,,,,,,,,,158,545,171,33,2,29,3,95,80,11,3,143,15,5,2,,.314,.459,.541,.435
José Abreu,1B/DH,White Sox,,7346,547989,,$24.42,,,,,,,,,,,,,,,,154,613,178,34,3,30,2,88,101,,,39,11,15,1,,.290,.347,.502,.364
Eric Hosmer,1B,Royals,,5082,543333,hosmeer01,$22.70,,,,,,,,,,,,,,,,158,599,178,33,5,18,3,98,93,7,3,61,6,3,3,1,.297,.363,.459,.362
Todd Frazier,1B/3B,Reds,,2863,453943,frazito01,$21.94,,,,,,,,,,,,,,,,157,619,158,43,1,35,6,82,89,13,8,44,3,7,7,1,.255,.308,.498,.348
Prince Fielder,1B/DH,Rangers,,3131,425902,fieldpr01,$20.92,,,,,,,,,,,,,,,,158,613,187,28,,23,3,78,98,,,64,14,11,5,,.305,.378,.463,.366
Albert Pujols,1B/DH,Angels,,3503,405395,pujolal01,$20.69,,,,,,,,,,,,,,,,157,602,147,22,,40,5,85,95,5,3,50,10,6,3,,.244,.307,.480,.339
Kendrys Morales,1B/DH,Royals,,1672,434778,moralke01,$18.96,,,,,,,,,,,,,,,,158,569,165,41,2,22,5,81,106,,,58,4,8,4,,.290,.362,.485,.372
Adrián González,1B,Dodgers,,3959,408236,gonzaad01,$15.10,,,,,,,,,,,,,,,,156,571,157,33,,28,5,76,90,,1,62,10,6,3,,.275,.350,.480,.361
Miguel Cabrera,1B/DH,Tigers,,1210,408234,cabremi01,$13.15,,,,,,,,,,,,,,,,119,429,145,28,1,18,1,64,76,1,1,77,15,3,2,,.338,.440,.534,.417
Stephen Vogt,1B/C,Athletics,,632,519390,vogtst01,$12.78,,,,,,,,,,,,,,,,136,445,116,21,3,18,4,58,71,,2,56,6,2,8,,.261,.341,.443,.342
Adam Lind,1B/DH,Brewers,,800,452252,lindad01,$9.19,,,,,,,,,,,,,,,,149,502,139,32,,20,4,72,87,,,66,11,1,3,,.277,.360,.460,.358
Brandon Belt,1B,Giants,,4113,474832,beltbr01,$9.07,,,,,,,,,,,,,,,,137,492,138,33,5,18,4,73,68,9,3,56,2,4,4,,.280,.356,.478,.368
Logan Forsythe,1B/2B/DH,Rays,,3977,523253,forsylo01,$8.22,,,,,,,,,,,,,,,,153,540,152,33,2,17,4,69,68,9,4,55,2,14,6,,.281,.359,.444,.358
Mark Teixeira,1B,Yankees,,285,407893,teixema01,$7.73,,,,,,,,,,,,,,,,111,392,100,22,,31,2,57,79,2,,59,6,6,5,,.255,.357,.548,.385
Mitch Moreland,1B/DH,Rangers,,4519,519048,morelmi01,$6.43,,,,,,,,,,,,,,,,132,471,131,27,,23,3,51,85,1,,32,2,7,5,,.278,.330,.482,.354
Carlos Santana,1B/3B/DH,Indians,,1047,467793,santaca01,$4.80,,,,,,,,,,,,,,,,154,550,127,29,2,19,3,72,85,11,3,108,8,3,5,,.231,.357,.395,.339
Pedro Alvarez,1B/3B,Pirates,,3320,476883,alvarpe01,$3.84,,,,,,,,,,,,,,,,150,437,106,18,,27,3,60,77,2,,48,9,2,4,,.243,.318,.469,.339
Lucas Duda,1B,Mets,,4970,446263,dudalu01,$3.71,,,,,,,,,,,,,,,,135,471,115,33,,27,2,67,73,,2,66,7,14,3,,.244,.352,.486,.360
Danny Valencia,1B/3B/LF,Athletics,,1549,502143,valenda01,$2.56,,,,,,,,,,,,,,,,105,345,100,23,1,18,2,59,66,2,2,29,3,1,2,1,.290,.344,.519,.371
Freddie Freeman,1B,Braves,,1836,518692,freemfr01,$2.50,,,,,,,,,,,,,,,,118,416,115,27,,18,2,62,66,3,1,56,4,7,2,,.276,.370,.471,.369
Chris Colabello,1B/LF/RF,Blue Jays,,6327,499624,colabch01,$1.13,,,,,,,,,,,,,,,,101,333,107,19,1,15,2,55,54,2,,22,,3,2,,.321,.367,.520,.389
Mark Trumbo,1B/DH/LF/RF,Mariners,,1675,444432,trumbma01,$1.00,,,,,,,,,,,,,,,,142,508,133,23,3,22,9,62,64,,,36,1,,1,,.262,.310,.449,.343
Mark Canha,1B/LF,Athletics,,5757,592192,,$1.00,,,,,,,,,,,,,,,,124,441,112,22,3,16,4,61,70,7,2,33,,8,3,,.254,.315,.426,.332
Justin Bour,1B,Marlins,,2645,571506,,$1.00,,,,,,,,,,,,,,,,129,409,107,20,,23,1,42,73,,,34,3,2,1,,.262,.321,.479,.344
Yangervis Solarte,1B/2B/3B,Padres,,1580,500208,,$1.00,,,,,,,,,,,,,,,,152,526,142,33,4,14,4,63,63,1,,34,,6,3,2,.270,.319,.428,.333
Joe Mauer,1B/DH,Twins,,1521,408045,mauerjo01,$1.00,,,,,,,,,,,,,,,,158,592,157,34,2,10,9,69,66,2,1,67,12,1,5,1,.265,.338,.380,.326
Yasmani Grandal,1B/C,Dodgers,,4985,518735,grandya01,$1.00,,,,,,,,,,,,,,,,115,355,83,12,,16,,43,47,,1,65,1,2,3,1,.234,.352,.403,.335
Ryan Howard,1B,Phillies,,2318,429667,howarry01,$-1.01,,,,,,,,,,,,,,,,129,467,107,29,1,23,,53,77,,,27,2,5,3,,.229,.277,.443,.307
Billy Butler,1B/DH,Athletics,,1375,456714,butlebi03,$-2.37,,,,,,,,,,,,,,,,151,538,135,28,1,15,2,63,65,,,52,4,7,4,,.251,.323,.390,.316
Luis Valbuena,1B/2B/3B,Astros,,1067,472528,valbulu01,$-2.83,,,,,,,,,,,,,,,,132,434,97,18,,25,4,62,56,1,,50,1,6,3,,.224,.310,.438,.332
Chris Carter,1B/DH,Astros,,4819,474892,cartech02,$-6.46,,,,,,,,,,,,,,,,129,391,78,17,,24,2,50,64,1,2,57,1,6,5,,.199,.307,.427,.321
Ryan Zimmerman,1B/3B/LF,Nationals,,2519,475582,zimmery01,$-6.88,,,,,,,,,,,,,,,,95,346,86,25,1,16,6,43,73,1,,33,,1,10,,.249,.308,.465,.343
C.J. Cron,1B/DH,Angels,,6756,543068,,$-6.97,,,,,,,,,,,,,,,,113,378,99,17,1,16,,37,51,3,1,17,1,5,3,,.262,.300,.439,.319
Logan Morrison,1B,Rays,,1974,489149,morrilo01,$-7.09,,,,,,,,,,,,,,,,146,457,103,15,3,17,3,47,54,8,4,47,5,4,2,1,.225,.301,.383,.304
Justin Smoak,1B,Blue Jays,,4469,475253,smoakju01,$-7.85,,,,,,,,,,,,,,,,132,296,67,16,1,18,3,44,59,,,29,,2,1,,.226,.299,.470,.338
Marwin Gonzalez,1B/3B/SS,Astros,,2731,503556,gonzama01,$-8.21,,,,,,,,,,,,,,,,120,344,96,18,1,12,2,44,34,4,5,16,,3,,7,.279,.311,.442,.331
Wilin Rosario,1B/C,Rockies,,3790,501647,rosarwi01,$-8.89,,,,,,,,,,,,,,,,87,231,62,14,1,6,1,22,29,2,1,8,2,1,1,1,.268,.293,.416,.309
Mike Napoli,1B,Rangers,,1665,435063,napolmi01,$-9.47,,,,,,,,,,,,,,,,133,407,91,20,1,18,8,46,50,3,3,57,3,4,1,,.224,.324,.410,.336
Victor Martínez,1B/DH,Tigers,,101,400121,martivi01,$-10.45,,,,,,,,,,,,,,,,120,440,108,20,,11,,39,64,,,31,8,7,7,,.245,.301,.366,.288
Ben Paulsen,1B/OF,Rockies,,5146,572019,,$-11.39,,,,,,,,,,,,,,,,116,325,90,19,4,11,3,42,49,1,2,23,,2,3,1,.277,.325,.462,.346
Brandon Moss,1B/LF/RF,Cardinals,,3401,461235,mossbr01,$-11.83,,,,,,,,,,,,,,,,145,469,106,24,2,19,1,47,58,,1,49,4,5,3,,.226,.304,.407,.309
Kelly Johnson,1B/2B/3B/LF,Mets,,3653,430637,johnske05,$-11.96,,,,,,,,,,,,,,,,111,310,82,11,,14,4,38,47,2,1,23,2,,1,,.265,.314,.435,.335
Yonder Alonso,1B,Padres,,2819,475174,alonsyo01,$-12.24,,,,,,,,,,,,,,,,103,354,100,18,1,5,1,50,31,2,5,42,3,3,3,,.282,.361,.381,.328
Travis Shaw,1B,Red Sox,,6826,543768,,$-13.80,,,,,,,,,,,,,,,,65,226,61,10,,13,2,31,36,,1,18,1,2,2,,.270,.327,.487,.353
J.P. Arencibia,1B/C,Rays,,717,450317,arencjp01,$-14.48,,,,,,,,,,,,,,,,24,71,22,3,,6,,9,17,,,1,,,1,,.310,.315,.606,.386
Brayan Pena,1B/C,Reds,,1372,430910,penabr01,$-14.53,,,,,,,,,,,,,,,,108,333,91,17,,,1,17,18,2,,29,1,2,1,2,.273,.332,.324,.303
Clint Robinson,1B/LF,Nationals,,1442,519208,robincl01,$-15.13,,,,,,,,,,,,,,,,126,309,84,15,1,10,3,44,34,,,37,4,5,1,,.272,.358,.424,.350
Steve Pearce,1B/DH/LF,Orioles,,3304,456665,pearcst01,$-17.15,,,,,,,,,,,,,,,,92,294,64,13,1,15,2,42,40,1,1,23,1,7,1,,.218,.289,.422,.312
Mark Reynolds,1B/3B,Cardinals,,3664,448602,reynoma01,$-17.26,,,,,,,,,,,,,,,,140,382,88,21,2,13,1,35,48,2,3,44,2,4,2,,.230,.315,.398,.312
Greg Bird,1B,Yankees,,6291,595885,,$-17.72,,,,,,,,,,,,,,,,46,157,41,9,,11,1,26,31,,,19,,1,1,,.261,.343,.529,.377
Wil Myers,1B/CF/RF,Padres,,5206,571976,myerswi01,$-18.13,,,,,,,,,,,,,,,,60,225,57,13,1,8,8,40,29,5,2,27,,1,,,.253,.336,.427,.365
James Loney,1B,Rays,,4640,425766,loneyja01,$-18.17,,,,,,,,,,,,,,,,104,361,101,16,,4,1,25,32,2,4,23,5,1,3,,.280,.322,.357,.297
Adam LaRoche,1B/DH,White Sox,,3650,425560,larocad01,$-19.00,,,,,,,,,,,,,,,,127,429,89,21,,12,4,41,44,,,49,,4,2,,.207,.293,.340,.292
Darin Ruf,1B/LF,Phillies,,5415,573131,rufda01,$-19.13,,,,,,,,,,,,,,,,106,268,63,12,,12,2,30,39,1,,21,,5,3,,.235,.300,.414,.318
Alex Avila,1B/C,Tigers,,1191,488671,avilaal01,$-19.19,,,,,,,,,,,,,,,,67,178,34,5,,4,,21,13,,1,40,,,,1,.191,.338,.287,.295
Ryan Lavarnway,1B/C,Braves,,99,543432,lavarry01,$-22.92,,,,,,,,,,,,,,,,37,94,18,6,,2,,6,6,,,12,1,,,,.191,.283,.319,.269
Jason Rogers,1B,Brewers,,6451,595386,,$-23.59,,,,,,,,,,,,,,,,86,152,45,6,2,4,1,22,16,,,15,,2,,,.296,.367,.441,.362
Justin Morneau,1B,Rockies,,1529,408047,morneju01,$-23.99,,,,,,,,,,,,,,,,49,168,52,10,3,3,2,19,15,,,13,2,1,,,.310,.363,.458,.366
Brett Wallace,1B,Padres,,758,477165,wallabr01,$-25.27,,,,,,,,,,,,,,,,64,96,29,6,,5,,14,16,,,10,1,1,,,.302,.374,.521,.384
Scott Van Slyke,1B/CF/LF/RF,Dodgers,,4716,475100,vanslsc01,$-25.49,,,,,,,,,,,,,,,,96,222,53,14,,6,,19,30,3,1,23,2,4,3,1,.239,.316,.383,.308
Matt Adams,1B,Cardinals,,5355,571431,adamsma01,$-25.77,,,,,,,,,,,,,,,,60,175,42,9,,5,,14,24,1,,10,1,,1,,.240,.280,.377,.286
Sean Rodríguez,1B/2B/DH/LF,Pirates,,631,446481,rodrise01,$-27.85,,,,,,,,,,,,,,,,139,224,55,12,1,4,2,25,17,2,2,5,,6,,5,.246,.275,.362,.289
Jesus Montero,1B,Mariners,,275,524968,monteje01,$-28.10,,,,,,,,,,,,,,,,38,112,25,6,,5,1,11,19,,,4,,,,,.223,.250,.411,.291
Ike Davis,1B,Athletics,,2128,477195,davisik02,$-28.10,,,,,,,,,,,,,,,,72,214,49,17,,3,3,19,20,,,23,,,2,,.229,.301,.350,.302
Eric Campbell,1B/3B/LF,Mets,,2153,493472,,$-28.71,,,,,,,,,,,,,,,,71,173,34,8,,3,,28,19,5,3,26,1,4,2,1,.197,.311,.295,.278
Kyle Blanks,1B,Rangers,,4000,452035,blankky01,$-28.94,,,,,,,,,,,,,,,,18,67,21,5,,3,1,10,6,1,,4,,,,,.313,.352,.522,.393
Chris Johnson,1B/3B,Indians,,2983,453400,johnsch05,$-28.97,,,,,,,,,,,,,,,,83,243,62,11,,3,2,18,18,2,1,10,,1,1,,.255,.286,.337,.284
Shane Peterson,1B/CF/LF,Brewers,,4856,451089,petersh01,$-29.67,,,,,,,,,,,,,,,,93,201,52,7,3,2,2,22,16,,1,20,1,,1,3,.259,.320,.353,.308
Tyler Moore,1B/LF,Nationals,,2493,489138,moorety01,$-30.07,,,,,,,,,,,,,,,,97,187,38,12,,6,3,14,27,,,11,2,1,1,,.203,.250,.364,.276
Adam Duvall,1B,Reds,,6383,594807,,$-30.68,,,,,,,,,,,,,,,,27,64,14,2,,5,,6,9,,,6,1,2,,,.219,.306,.484,.334
Michael Morse,1B/LF,Pirates,,2494,434604,morsemi01,$-30.79,,,,,,,,,,,,,,,,98,229,53,7,1,5,2,14,19,,,23,,4,,,.231,.312,.336,.301
Max Muncy,1B,Athletics,,9385,571970,,$-31.04,,,,,,,,,,,,,,,,45,102,21,8,1,3,,14,9,,,9,,,1,,.206,.268,.392,.286
Adam Rosales,1B/2B,Rangers,,4847,489267,rosalad01,$-32.04,,,,,,,,,,,,,,,,53,114,26,4,,3,1,14,7,4,4,10,,1,,,.228,.296,.342,.286
Nick Swisher,1B/DH/LF,Braves,,346,430897,swishni01,$-32.05,,,,,,,,,,,,,,,,76,219,43,9,,6,2,14,25,,,35,1,3,3,,.196,.312,.320,.294
Garrett Jones,1B/RF,Yankees,,3397,434540,jonesga02,$-32.10,,,,,,,,,,,,,,,,57,144,31,4,1,5,,12,17,,,8,,,,,.215,.257,.361,.270
Xavier Scruggs,1B,Cardinals,,5698,489305,,$-32.67,,,,,,,,,,,,,,,,17,42,11,2,,,1,5,7,1,,,,1,,,.262,.279,.310,.290
Alberto Callaspo,1B/2B/3B/DH,Dodgers,,1392,430948,callaal01,$-32.73,,,,,,,,,,,,,,,,97,230,54,7,,1,1,20,15,,,28,1,,2,1,.235,.314,.278,.278
Corey Hart,1B/DH,Pirates,,3192,430611,hartco01,$-32.77,,,,,,,,,,,,,,,,35,54,12,1,,2,,3,9,,,1,1,1,1,,.222,.246,.352,.251
Brandon Drury,1B,Diamondbacks,,5891,592273,,$-33.14,,,,,,,,,,,,,,,,20,56,12,3,,2,,3,8,,,2,,1,,,.214,.254,.375,.274
Jon Singleton,1B,Astros,,5593,572138,,$-33.24,,,,,,,,,,,,,,,,19,47,9,2,,1,,6,6,1,,10,,,1,,.191,.328,.298,.296
Jefry Marte,1B/3B,Tigers,,5687,527043,,$-33.62,,,,,,,,,,,,,,,,33,80,17,4,,4,,9,11,,,8,,,,2,.212,.278,.412,.303
Chris Parmelee,1B/LF/RF,Orioles,,1530,476633,parmech01,$-33.72,,,,,,,,,,,,,,,,32,97,21,7,1,4,,11,9,,1,4,,1,,,.216,.255,.433,.289
Peter O'Brien,1B,Diamondbacks,,7209,598284,,$-33.78,,,,,,,,,,,,,,,,8,10,4,1,,1,,1,3,,,2,,,,,.400,.500,.800,.537
Jeff Baker,1B/2B,Marlins,,2655,425557,bakerje03,$-34.32,,,,,,,,,,,,,,,,41,72,15,3,,3,1,11,8,,,8,,,,,.208,.287,.375,.304
Ryan Rua,1B/LF,Rangers,,10470,607387,,$-34.34,,,,,,,,,,,,,,,,28,83,16,5,,4,2,10,7,,,3,,,,,.193,.221,.398,.284
Jake Elmore,1B/2B,Rays,,5670,518653,elmorja01,$-34.35,,,,,,,,,,,,,,,,51,141,29,5,,2,1,10,16,1,1,12,1,,3,2,.206,.259,.284,.248
Kyle Parker,1B/LF,Rockies,,4266,592621,,$-34.66,,,,,,,,,,,,,,,,46,106,19,3,1,3,,10,11,1,,6,,,,,.179,.223,.311,.238
Matt Duffy,1B,Astros,,10560,592274,,$-34.71,,,,,,,,,,,,,,,,8,8,3,1,,,,,3,,,1,,,,,.375,.444,.500,.417
Jesús Aguilar,1B,Indians,,6259,542583,,$-34.86,,,,,,,,,,,,,,,,7,19,6,1,,,,,2,,,,,1,,,.316,.350,.368,.323
Allan Dykstra,1B,Rays,,4881,488852,,$-35.02,,,,,,,,,,,,,,,,13,31,4,,,1,,3,4,,,6,,1,,,.129,.289,.226,.253
Casey McGehee,1B/3B,Marlins,,3148,431171,mcgehca01,$-35.03,,,,,,,,,,,,,,,,109,237,47,12,,2,1,14,20,1,1,21,,,,,.198,.264,.274,.248
Efren Navarro,1B/LF,Angels,,1673,519068,navaref01,$-35.44,,,,,,,,,,,,,,,,54,83,21,4,,,,9,5,,2,5,1,,,,.253,.295,.301,.254
Matt Hague,1B,Blue Jays,,5254,518755,haguema01,$-35.45,,,,,,,,,,,,,,,,10,12,3,1,,,,1,,,,2,1,1,,,.250,.400,.333,.318
Trever Adams,1B,Rangers,,5927,605112,,$-35.63,,,,,,,,,,,,,,,,,,,,,,,,,,,,,,,,,,,
Eric Aguilera,1B,Angels,,10946,,,$-35.63,,,,,,,,,,,,,,,,,,,,,,,,,,,,,,,,,,,
John Alexander,1B,Rays,,10215,,,$-35.63,,,,,,,,,,,,,,,,,,,,,,,,,,,,,,,,,,,
Anthony Aliotti,1B,Athletics,,5178,572675,,$-35.63,,,,,,,,,,,,,,,,,,,,,,,,,,,,,,,,,,,
Brandon Allen,1B,Mets,,3643,450315,allenbr01,$-35.63,,,,,,,,,,,,,,,,,,,,,,,,,,,,,,,,,,,
Stetson Allie,1B,Pirates,,10552,592105,,$-35.63,,,,,,,,,,,,,,,,,,,,,,,,,,,,,,,,,,,
Japhet Amador,1B,Astros,,7415,515189,,$-35.63,,,,,,,,,,,,,,,,,,,,,,,,,,,,,,,,,,,
Lars Anderson,1B,Dodgers,,108,502249,anderla03,$-35.63,,,,,,,,,,,,,,,,,,,,,,,,,,,,,,,,,,,
Leslie Anderson,1B,Rays,,4951,493306,,$-35.63,,,,,,,,,,,,,,,,,,,,,,,,,,,,,,,,,,,
Jeff Arnold,1B,Giants,,6943,594740,,$-35.63,,,,,,,,,,,,,,,,,,,,,,,,,,,,,,,,,,,
Keon Barnum,1B,White Sox,,10175,621572,,$-35.63,,,,,,,,,,,,,,,,,,,,,,,,,,,,,,,,,,,
Daric Barton,1B,Blue Jays,,4818,435558,bartoda02,$-35.63,,,,,,,,,,,,,,,,,,,,,,,,,,,,,,,,,,,
Nick Basto,1B,White Sox,,11126,621007,,$-35.63,,,,,,,,,,,,,,,,,,,,,,,,,,,,,,,,,,,
Aaron Bates,1B,Dodgers,,109,488686,batesaa01,$-35.63,,,,,,,,,,,,,,,,,,,,,,,,,,,,,,,,,,,
Jake Bauers,1B,Rays,,10537,641343,,$-35.63,,,,,,,,,,,,,,,,,,,,,,,,,,,,,,,,,,,
Gerald Bautista,1B,Indians,,11241,644366,,$-35.63,,,,,,,,,,,,,,,,,,,,,,,,,,,,,,,,,,,
William Beckwith,1B,Braves,,5692,542922,,$-35.63,,,,,,,,,,,,,,,,,,,,,,,,,,,,,,,,,,,
Cody Bellinger,1B,Dodgers,,10872,641355,,$-35.63,,,,,,,,,,,,,,,,,,,,,,,,,,,,,,,,,,,
Vince Belnome,1B,Rays,,4884,572714,,$-35.63,,,,,,,,,,,,,,,,,,,,,,,,,,,,,,,,,,,
Michael Bianucci,1B,Royals,,5785,518453,,$-35.63,,,,,,,,,,,,,,,,,,,,,,,,,,,,,,,,,,,
Dan Black,1B,White Sox,,6538,542941,,$-35.63,,,,,,,,,,,,,,,,,,,,,,,,,,,,,,,,,,,
Justin Bloxom,1B,Nationals,,5665,572721,,$-35.63,,,,,,,,,,,,,,,,,,,,,,,,,,,,,,,,,,,
Russell Branyan,1B,Indians,,1052,137140,branyru01,$-35.63,,,,,,,,,,,,,,,,,,,,,,,,,,,,,,,,,,,
Mike Carp,1B,Dodgers,,4297,455077,carpmi01,$-35.63,,,,,,,,,,,,,,,,,,,,,,,,,,,,,,,,,,,
Erik Castro,1B,Braves,,7297,571549,,$-35.63,,,,,,,,,,,,,,,,,,,,,,,,,,,,,,,,,,,
Chun-Hsiu Chen,1B,Indians,,5152,544560,,$-35.63,,,,,,,,,,,,,,,,,,,,,,,,,,,,,,,,,,,
David Chester,1B,Red Sox,,6027,607495,,$-35.63,,,,,,,,,,,,,,,,,,,,,,,,,,,,,,,,,,,
Ji Man Choi,1B,Mariners,,7377,596847,,$-35.63,,,,,,,,,,,,,,,,,,,,,,,,,,,,,,,,,,,
David Cooper,1B,Indians,,734,476036,coopeda01,$-35.63,,,,,,,,,,,,,,,,,,,,,,,,,,,,,,,,,,,
Garrett Cooper,1B,Brewers,,9475,643265,,$-35.63,,,,,,,,,,,,,,,,,,,,,,,,,,,,,,,,,,,
Kevin Cron,1B,Diamondbacks,,11000,605196,,$-35.63,,,,,,,,,,,,,,,,,,,,,,,,,,,,,,,,,,,
Matt Curry,1B,Pirates,,6037,,,$-35.63,,,,,,,,,,,,,,,,,,,,,,,,,,,,,,,,,,,
Charles Cutler,1B,Angels,,3485,475715,,$-35.63,,,,,,,,,,,,,,,,,,,,,,,,,,,,,,,,,,,
O`Koyea Dickson,1B,Dodgers,,6565,607297,,$-35.63,,,,,,,,,,,,,,,,,,,,,,,,,,,,,,,,,,,
Matt Downs,1B,Marlins,,4128,453303,downsma01,$-35.63,,,,,,,,,,,,,,,,,,,,,,,,,,,,,,,,,,,
Aaron Dudley,1B,Marlins,,5912,571631,,$-35.63,,,,,,,,,,,,,,,,,,,,,,,,,,,,,,,,,,,
Lance Durham,1B,Tigers,,10202,,,$-35.63,,,,,,,,,,,,,,,,,,,,,,,,,,,,,,,,,,,
Edwin Espinal,1B,Pirates,,10952,606340,,$-35.63,,,,,,,,,,,,,,,,,,,,,,,,,,,,,,,,,,,
Nick Evans,1B,Diamondbacks,,2188,452783,evansni01,$-35.63,,,,,,,,,,,,,,,,,,,,,,,,,,,,,,,,,,,
Will Ferrell,1B,Padres,,10887,,,$-35.63,,,,,,,,,,,,,,,,,,,,,,,,,,,,,,,,,,,
Dominic Ficociello,1B,Tigers,,7564,592301,,$-35.63,,,,,,,,,,,,,,,,,,,,,,,,,,,,,,,,,,,
Matt Fields,1B,Royals,,568,446612,,$-35.63,,,,,,,,,,,,,,,,,,,,,,,,,,,,,,,,,,,
Nate Freiman,1B,Athletics,,3958,474384,freimna01,$-35.63,,,,,,,,,,,,,,,,,,,,,,,,,,,,,,,,,,,
Ian Gac,1B,Royals,,4464,453880,,$-35.63,,,,,,,,,,,,,,,,,,,,,,,,,,,,,,,,,,,
Henry Garcia,1B,Rockies,,11070,622654,,$-35.63,,,,,,,,,,,,,,,,,,,,,,,,,,,,,,,,,,,
Matthew Gedman,1B,Red Sox,,10201,,,$-35.63,,,,,,,,,,,,,,,,,,,,,,,,,,,,,,,,,,,
Jake Goebbert,1B,Padres,,5303,572876,,$-35.63,,,,,,,,,,,,,,,,,,,,,,,,,,,,,,,,,,,
Jhonny Gomez,1B,Rangers,,7276,517465,,$-35.63,,,,,,,,,,,,,,,,,,,,,,,,,,,,,,,,,,,
Dean Green,1B,Tigers,,6056,606987,,$-35.63,,,,,,,,,,,,,,,,,,,,,,,,,,,,,,,,,,,
Jonathan Griffin,1B,Diamondbacks,,5768,518745,,$-35.63,,,,,,,,,,,,,,,,,,,,,,,,,,,,,,,,,,,
Ronald Guzmán,1B,Rangers,,10050,608597,,$-35.63,,,,,,,,,,,,,,,,,,,,,,,,,,,,,,,,,,,
Casey Haerther,1B,Orioles,,10580,,,$-35.63,,,,,,,,,,,,,,,,,,,,,,,,,,,,,,,,,,,
Sean Halton,1B,Orioles,,5228,488936,haltose01,$-35.63,,,,,,,,,,,,,,,,,,,,,,,,,,,,,,,,,,,
Mark Hamilton,1B,Braves,,3502,453236,hamilma01,$-35.63,,,,,,,,,,,,,,,,,,,,,,,,,,,,,,,,,,,
Cyle Hankerd,1B,Angels,,3649,458088,,$-35.63,,,,,,,,,,,,,,,,,,,,,,,,,,,,,,,,,,,
Danny Hayes,1B,White Sox,,10890,643356,,$-35.63,,,,,,,,,,,,,,,,,,,,,,,,,,,,,,,,,,,
Drew Hedman,1B,Red Sox,,5842,572913,,$-35.63,,,,,,,,,,,,,,,,,,,,,,,,,,,,,,,,,,,
Matt Helm,1B,Diamondbacks,,6897,545344,,$-35.63,,,,,,,,,,,,,,,,,,,,,,,,,,,,,,,,,,,
Tyler Henson,1B,Phillies,,452,502335,,$-35.63,,,,,,,,,,,,,,,,,,,,,,,,,,,,,,,,,,,
Jeff Holm,1B,Tigers,,10156,,,$-35.63,,,,,,,,,,,,,,,,,,,,,,,,,,,,,,,,,,,
Rhyne Hughes,1B,Mets,,438,446560,hugherh01,$-35.63,,,,,,,,,,,,,,,,,,,,,,,,,,,,,,,,,,,
Gabriel Jacobo,1B,Blue Jays,,1671,543353,,$-35.63,,,,,,,,,,,,,,,,,,,,,,,,,,,,,,,,,,,
Chris Jacobs,1B,White Sox,,6883,518838,,$-35.63,,,,,,,,,,,,,,,,,,,,,,,,,,,,,,,,,,,
Mike Jacobs,1B,Diamondbacks,,2132,408312,jacobmi02,$-35.63,,,,,,,,,,,,,,,,,,,,,,,,,,,,,,,,,,,
Luis Jimenez,1B,Blue Jays,,2490,455921,jimenlu01,$-35.63,,,,,,,,,,,,,,,,,,,,,,,,,,,,,,,,,,,
Matt Juengel,1B,Marlins,,10026,623251,,$-35.63,,,,,,,,,,,,,,,,,,,,,,,,,,,,,,,,,,,
Kila Ka`aihue,1B,Nationals,,1376,451500,kaaihki01,$-35.63,,,,,,,,,,,,,,,,,,,,,,,,,,,,,,,,,,,
A.J. Kirby-Jones,1B,Padres,,6945,594882,,$-35.63,,,,,,,,,,,,,,,,,,,,,,,,,,,,,,,,,,,
Casey Kotchman,1B,Royals,,4301,425773,kotchca01,$-35.63,,,,,,,,,,,,,,,,,,,,,,,,,,,,,,,,,,,
Bryan LaHair,1B,Red Sox,,2694,445933,lahaibr01,$-35.63,,,,,,,,,,,,,,,,,,,,,,,,,,,,,,,,,,,
Matt LaPorta,1B,Orioles,,1057,453181,laporma01,$-35.63,,,,,,,,,,,,,,,,,,,,,,,,,,,,,,,,,,,
Jordy Lara,1B,Mariners,,10048,570797,,$-35.63,,,,,,,,,,,,,,,,,,,,,,,,,,,,,,,,,,,
Jeff Larish,1B,Pirates,,1290,460252,larisje01,$-35.63,,,,,,,,,,,,,,,,,,,,,,,,,,,,,,,,,,,
Ben Lasater,1B,Marlins,,5758,518918,,$-35.63,,,,,,,,,,,,,,,,,,,,,,,,,,,,,,,,,,,
Jordan Lennerton,1B,Tigers,,5901,444952,,$-35.63,,,,,,,,,,,,,,,,,,,,,,,,,,,,,,,,,,,
Patrick Leonard,1B,Rays,,10227,596018,,$-35.63,,,,,,,,,,,,,,,,,,,,,,,,,,,,,,,,,,,
Seth Loman,1B,Braves,,896,446411,,$-35.63,,,,,,,,,,,,,,,,,,,,,,,,,,,,,,,,,,,
Roberto Lopez,1B,Angels,,6475,543464,,$-35.63,,,,,,,,,,,,,,,,,,,,,,,,,,,,,,,,,,,
Joe Mahoney,1B,Marlins,,5023,518977,mahonjo01,$-35.63,,,,,,,,,,,,,,,,,,,,,,,,,,,,,,,,,,,
Trey Mancini,1B,Orioles,,9387,641820,,$-35.63,,,,,,,,,,,,,,,,,,,,,,,,,,,,,,,,,,,
José Marmolejos,1B,Nationals,,11204,592530,,$-35.63,,,,,,,,,,,,,,,,,,,,,,,,,,,,,,,,,,,
Jose Marmolejos,1B,Nationals,,11240,,,$-35.63,,,,,,,,,,,,,,,,,,,,,,,,,,,,,,,,,,,
Chris Marrero,1B,Orioles,,2492,502029,marrech01,$-35.63,,,,,,,,,,,,,,,,,,,,,,,,,,,,,,,,,,,
Christian Marrero,1B,White Sox,,897,461842,,$-35.63,,,,,,,,,,,,,,,,,,,,,,,,,,,,,,,,,,,
Mike McDade,1B,Orioles,,737,519005,,$-35.63,,,,,,,,,,,,,,,,,,,,,,,,,,,,,,,,,,,
Chris McGuiness,1B,Phillies,,111,573027,mcguich01,$-35.63,,,,,,,,,,,,,,,,,,,,,,,,,,,,,,,,,,,
Blake Miller,1B,Giants,,9479,,,$-35.63,,,,,,,,,,,,,,,,,,,,,,,,,,,,,,,,,,,
Hunter Morris,1B,Pirates,,6228,519051,,$-35.63,,,,,,,,,,,,,,,,,,,,,,,,,,,,,,,,,,,
Jim Murphy,1B,Phillies,,5276,543582,,$-35.63,,,,,,,,,,,,,,,,,,,,,,,,,,,,,,,,,,,
Luke Murton,1B,Yankees,,5181,474854,,$-35.63,,,,,,,,,,,,,,,,,,,,,,,,,,,,,,,,,,,
Brad Nelson,1B,Twins,,4303,434525,nelsobr02,$-35.63,,,,,,,,,,,,,,,,,,,,,,,,,,,,,,,,,,,
John Nogowski,1B,Athletics,,6591,596056,,$-35.63,,,,,,,,,,,,,,,,,,,,,,,,,,,,,,,,,,,
Matt Olson,1B,Athletics,,9384,621566,,$-35.63,,,,,,,,,,,,,,,,,,,,,,,,,,,,,,,,,,,
Ricky Oropesa,1B,Giants,,5824,543609,,$-35.63,,,,,,,,,,,,,,,,,,,,,,,,,,,,,,,,,,,
Brian O`Grady,1B,Reds,,10694,,,$-35.63,,,,,,,,,,,,,,,,,,,,,,,,,,,,,,,,,,,
Daniel Palka,1B,Diamondbacks,,11026,594953,,$-35.63,,,,,,,,,,,,,,,,,,,,,,,,,,,,,,,,,,,
Daniel Paolini,1B,Mariners,,11008,605415,,$-35.63,,,,,,,,,,,,,,,,,,,,,,,,,,,,,,,,,,,
Brock Peterson,1B,Twins,,1531,453857,peterbr02,$-35.63,,,,,,,,,,,,,,,,,,,,,,,,,,,,,,,,,,,
Shawn Pleffner,1B,Nationals,,10907,607410,,$-35.63,,,,,,,,,,,,,,,,,,,,,,,,,,,,,,,,,,,
Rich Poythress,1B,Braves,,5440,534562,,$-35.63,,,,,,,,,,,,,,,,,,,,,,,,,,,,,,,,,,,
Correlle Prime,1B,Rockies,,10705,623194,,$-35.63,,,,,,,,,,,,,,,,,,,,,,,,,,,,,,,,,,,
Nick Ramirez,1B,Brewers,,5714,598286,,$-35.63,,,,,,,,,,,,,,,,,,,,,,,,,,,,,,,,,,,
David Renfroe,1B,Red Sox,,6332,572062,,$-35.63,,,,,,,,,,,,,,,,,,,,,,,,,,,,,,,,,,,
Jordan Ribera,1B,Rockies,,7068,607264,,$-35.63,,,,,,,,,,,,,,,,,,,,,,,,,,,,,,,,,,,
Myrio Richard,1B,Athletics,,6961,572069,,$-35.63,,,,,,,,,,,,,,,,,,,,,,,,,,,,,,,,,,,
Harold Riggins,1B,Marlins,,10524,543694,,$-35.63,,,,,,,,,,,,,,,,,,,,,,,,,,,,,,,,,,,
Juan Rivera,1B,Diamondbacks,,1716,407487,riverju01,$-35.63,,,,,,,,,,,,,,,,,,,,,,,,,,,,,,,,,,,
James Robbins,1B,Tigers,,5902,572078,,$-35.63,,,,,,,,,,,,,,,,,,,,,,,,,,,,,,,,,,,
Jonathan Rodriguez,1B,Cardinals,,6016,572088,,$-35.63,,,,,,,,,,,,,,,,,,,,,,,,,,,,,,,,,,,
Nellie Rodriguez,1B,Indians,,10829,608364,,$-35.63,,,,,,,,,,,,,,,,,,,,,,,,,,,,,,,,,,,
Reynaldo Rodriguez,1B,Twins,,10970,,,$-35.63,,,,,,,,,,,,,,,,,,,,,,,,,,,,,,,,,,,
Kiel Roling,1B,Rockies,,5846,501908,,$-35.63,,,,,,,,,,,,,,,,,,,,,,,,,,,,,,,,,,,
Kyle Roller,1B,Yankees,,6075,572393,,$-35.63,,,,,,,,,,,,,,,,,,,,,,,,,,,,,,,,,,,
Pedro Ruiz,1B,Angels,,10519,,,$-35.63,,,,,,,,,,,,,,,,,,,,,,,,,,,,,,,,,,,
Randy Ruiz,1B,Yankees,,801,457859,ruizra01,$-35.63,,,,,,,,,,,,,,,,,,,,,,,,,,,,,,,,,,,
Jerrud Sabourin,1B,Indians,,6975,607949,,$-35.63,,,,,,,,,,,,,,,,,,,,,,,,,,,,,,,,,,,
Gaby Sanchez,1B,Pirates,,1975,459991,sanchga01,$-35.63,,,,,,,,,,,,,,,,,,,,,,,,,,,,,,,,,,,
Josh Satin,1B,Reds,,5249,543744,satinjo01,$-35.63,,,,,,,,,,,,,,,,,,,,,,,,,,,,,,,,,,,
Scott Savastano,1B,Orioles,,7269,489293,,$-35.63,,,,,,,,,,,,,,,,,,,,,,,,,,,,,,,,,,,
Jared Schlehuber,1B,Royals,,10143,,,$-35.63,,,,,,,,,,,,,,,,,,,,,,,,,,,,,,,,,,,
Frank Schwindel,1B,Royals,,11162,643524,,$-35.63,,,,,,,,,,,,,,,,,,,,,,,,,,,,,,,,,,,
Cameron Seitzer,1B,Rays,,7196,607081,,$-35.63,,,,,,,,,,,,,,,,,,,,,,,,,,,,,,,,,,,
Alejandro Selen,1B,Rangers,,7277,501545,,$-35.63,,,,,,,,,,,,,,,,,,,,,,,,,,,,,,,,,,,
Barrett Serrato,1B,Rangers,,7278,543761,,$-35.63,,,,,,,,,,,,,,,,,,,,,,,,,,,,,,,,,,,
Joe Sever,1B,Indians,,10072,608711,,$-35.63,,,,,,,,,,,,,,,,,,,,,,,,,,,,,,,,,,,
Rock Shoulders,1B,Rangers,,9458,592740,,$-35.63,,,,,,,,,,,,,,,,,,,,,,,,,,,,,,,,,,,
Alexander Simon,1B,Rays,,11080,,,$-35.63,,,,,,,,,,,,,,,,,,,,,,,,,,,,,,,,,,,
Austen Smith,1B,Marlins,,11210,,,$-35.63,,,,,,,,,,,,,,,,,,,,,,,,,,,,,,,,,,,
Bobby Smith,1B,Athletics,,4824,,smithbo06,$-35.63,,,,,,,,,,,,,,,,,,,,,,,,,,,,,,,,,,,
Dominic Smith,1B,Mets,,9995,642086,,$-35.63,,,,,,,,,,,,,,,,,,,,,,,,,,,,,,,,,,,
Brandon Snyder,1B,Orioles,,441,474319,snydebr03,$-35.63,,,,,,,,,,,,,,,,,,,,,,,,,,,,,,,,,,,
Michael Snyder,1B,Angels,,11153,621551,,$-35.63,,,,,,,,,,,,,,,,,,,,,,,,,,,,,,,,,,,
Neftali Soto,1B,White Sox,,2838,519304,sotone01,$-35.63,,,,,,,,,,,,,,,,,,,,,,,,,,,,,,,,,,,
Casey Stevenson,1B,Yankees,,7009,548361,,$-35.63,,,,,,,,,,,,,,,,,,,,,,,,,,,,,,,,,,,
Jon Talley,1B,Blue Jays,,5997,,,$-35.63,,,,,,,,,,,,,,,,,,,,,,,,,,,,,,,,,,,
Luis Tejada,1B,Padres,,6473,593776,,$-35.63,,,,,,,,,,,,,,,,,,,,,,,,,,,,,,,,,,,